program: Gaussian 09
title: 000101493
version: EM64L-G09RevD.01
frameworkgroup: C1[X(C8H10N2O)]
method: RPBEPBE
basis: SDD
operation: Freq
keyword: #p
keyword: freq=noraman
keyword: PBEPBE/SDD
title: #p freq=noraman PBEPBE/SDD
converged: YES YES NO NO
title: Mulliken charges:
elementType: O N N C C C C C C C C H H H H H H H H H H
charge: -0.275209 -0.154195 0.050398 0.409145 0.455353 -0.333026 -0.351490 -0.428206 -0.336677 -0.805354 -0.678708 0.241571 0.280248 0.232201 0.233256 0.233354 0.224737 0.232362 0.278708 0.245794 0.245736
chargesum: 0.00000
title: Mulliken charges with hydrogens summed into heavy atoms:
elementType: O N N C C C C C C C C
charge: -0.275209 -0.154195 0.050398 0.409145 0.455353 -0.091455 -0.071242 -0.196005 -0.103420 -0.114900 0.091531
polarizability: 1.78367028e+02 -6.68006760e+00 1.06430260e+02 -5.73868678e-02 -1.37935603e-02 5.12568396e+01
1716.lowfreq: -9.4212 -7.3062 -4.0120 -0.0010 -0.0009 -0.0008 25.0328 41.2829 87.4047
frequency: 24.6378 41.2687 87.4007 171.3465 178.4554 204.5172 312.2513 323.9870 332.8924 392.5126 393.4208 407.2653 449.5912 519.9422 602.0520 635.1150 715.7346 769.6325 805.8485 817.2387 842.4887 866.8028 945.4152 984.8459 986.2632 1005.9154 1047.1913 1050.1444 1103.5919 1125.0735 1170.9773 1195.6982 1225.7694 1302.0891 1309.9398 1351.5183 1383.7500 1399.1378 1410.6357 1420.9730 1469.2738 1469.6620 1477.2471 1486.6462 1506.3941 1584.2551 1624.4298 2976.1290 2989.1692 3053.5700 3082.8286 3084.6298 3101.5598 3126.1509 3130.9710 3164.5702 3191.7598
redmass: 3.4544 1.0774 3.6018 4.9776 1.2272 3.1221 4.0777 5.0566 3.0986 4.7474 4.9177 2.9030 4.1974 2.6120 5.3636 6.8587 3.0383 4.5994 5.8965 1.4244 1.3146 3.6512 1.3403 1.3447 1.4733 2.8426 1.5512 4.8230 1.3205 1.4042 1.6956 1.1392 2.8123 4.1944 1.3805 4.9559 5.1351 1.2629 1.3363 2.9688 1.0508 1.0563 1.1230 1.0476 2.7703 6.3410 6.3454 1.0374 1.0321 1.0975 1.1025 1.0987 1.0995 1.0906 1.0892 1.0945 1.0939
irintensity: 4.2737 0.3077 0.3340 5.1163 0.0632 0.6010 4.9716 0.5707 0.4946 4.7406 2.2323 0.0055 1.9851 21.2773 1.8061 0.8974 1.2329 8.8188 29.7826 46.8054 20.8347 147.0442 1.7423 1.8752 2.1924 9.7682 12.0910 121.7002 0.0138 10.1302 20.5600 13.0775 1.0078 34.7337 30.0584 125.9444 56.4589 6.0194 35.0913 6.9670 18.9608 25.6406 17.7822 22.2587 87.8201 2.8175 0.6543 37.3498 22.1036 20.2898 18.9842 19.6009 2.9244 17.7842 19.3162 11.8086 0.5750
temp: 298.150 k
press: 1.00000 atm
elementType: 8 7 7 6 6 6 6 6 6 6 6 1 1 1 1 1 1 1 1 1 1
symmnumber: 1
zpe: 435635.6 jmol-1
zpe.correction: 0.165925 hartree
zpe.thermalcorrener: 0.176785 hartree
zpe.thermalcorrenthalpy: 0.177729 hartree
zpe.thermalcorrgfe: 0.128071 hartree
zpe.sumelectzpe: -494.704931 hartree
zpe.sumelectthermal: -494.694071 hartree
zpe.sumelectthermalent: -494.693127 hartree
zpe.sumelectthermalfe: -494.742785 hartree
dipole: -3.4139 2.8155 0.0105
dipole: 4.4252
quadrupole: -69.8850 -59.5083 -67.3817
quadrupole: 9.8301 -0.0116 -0.0080
quadrupole: -4.2933 6.0834 -1.7900 9.8301 -0.0116 -0.0080
hfenergy: -494.8708562 hartree
pointgroup: C01 [X(C8H10N2O1)]
dipole: -1.3579992 1.0690032 0.2101499 debye
dipolederiv: -1.6669705 0.571676 0.1622854 -0.174024 -0.222553 0.0107872 0.0829141 -0.0410554 -0.2202202 -0.8099865 0.0733572 0.0582362 0.8480008 -0.4655008 -0.0987522 0.1395238 -0.0443016 -0.1037834 1.5266797 -0.8039364 -0.1961264 -0.7817266 0.4010516 0.1041971 -0.1921757 0.1051631 -0.0452251 0.9138297 0.0463537 -0.0552486 0.0118013 -0.0568151 -0.0127339 -0.059373 -0.0152474 0.0589342 0.3997526 0.0479028 -0.0275122 0.0912403 -0.0901815 -0.0120198 -0.0314341 -0.0096119 -0.0339353 -0.1096922 -0.0194286 -0.0067698 0.1197361 0.0247206 0.0121003 0.0084486 0.0221821 -0.1763928 -0.1424846 -0.0284347 -0.00289 -0.1247405 -0.0211766 0.0213187 -0.0121262 0.0145199 -0.1378117 -0.1115899 -0.0142812 -0.0052368 -0.2416642 0.0846739 0.043127 -0.0277548 0.0269843 -0.1605062 -0.1511531 0.0213951 0.0009902 0.1731038 0.1416766 0.0182893 0.0175158 0.0292201 -0.1636363 -0.1467069 -0.0336423 0.0128036 -0.1476475 0.071525 0.0105274 0.0147495 0.0035476 0.0690719 -0.0490419 0.1420718 0.0340654 0.0744988 0.1208612 -0.0161064 0.0265243 -0.0207407 0.2202284 0.058592 -0.0861671 -0.0016472 -0.0932758 -0.0492634 -0.0150513 -0.0026191 -0.0155074 0.1604004 0.0789974 0.070012 0.0132697 0.0488874 0.038518 -0.0166117 0.0107748 -0.0182025 0.1645346 -0.0061971 0.1014704 0.0210537 0.1043477 -0.0398934 -0.0270256 0.0210492 -0.0263762 0.1468333 0.0297872 -0.0890355 -0.0012274 -0.0938557 -0.0683876 -0.0151188 -0.0020915 -0.0159931 0.1437338 -0.0178405 -0.0204777 0.0339812 -0.0448017 0.031427 0.1156558 0.1016789 0.102539 -0.0365271 0.0163623 0.0349466 0.0081846 0.1556032 -0.1018982 -0.0250659 0.0157552 -0.0186007 0.1064407 -0.0321523 -0.0264489 -0.0377696 -0.0434997 0.0581775 -0.0988866 -0.1120088 -0.0871524 -0.0450527 -0.0233431 -0.072911 0.0036381 0.1201006 0.1680536 -0.0052983 0.0238 0.0081522 0.1377157 0.1310011 0.0284586 0.0780327 -0.0099445 0.0010114 -0.0478853 0.0377527 -0.0749931 -0.0653531 0.1121567 0.0571192 -0.0921127 0.0078603 -0.0260269 0.0545528 -0.0609036 0.075474 -0.0194492 unknown
polarizability: 177.9412646|-4.505908|105.5782082|-9.4493073|5.9070761|52.5346541 unknown
InChI: InChI=1S/C8H10N2O/c1-7-3-5-8(6-4-7)10(2)9-11/h3-6H,1-2H3
charge 0 multiplicity 1
21 atoms
O  3.752735 -0.765046 -0.479223
N  1.752846 0.272951 -0.231179
N  2.481885 -0.918396 -0.406841
C  0.329449 0.137642 -0.145086
C  -2.518661 -0.107168 0.029824
C  -0.48239 1.2862 0.029486
C  -0.28868 -1.141788 -0.232689
C  -1.886517 1.155387 0.114431
C  -1.686907 -1.247639 -0.14543
C  -4.026914 -0.24996 0.123843
C  2.429782 1.577368 -0.14169
H  -0.036395 2.282426 0.100283
H  0.33028 -2.030817 -0.36736
H  -2.496096 2.056711 0.248963
H  -2.147149 -2.240966 -0.215305
H  -4.318796 -0.866092 0.995411
H  -4.52142 0.731123 0.226027
H  -4.441163 -0.74473 -0.774712
H  3.510501 1.381149 -0.237391
H  2.226908 2.057492 0.831544
H  2.102605 2.244854 -0.957906
