program: Gaussian 09
title: 000101483
version: EM64L-G09RevD.01
frameworkgroup: C1[X(C8H10N2O2)]
method: RPBEPBE
basis: SDD
operation: Freq
keyword: #p
keyword: freq=noraman
keyword: PBEPBE/SDD
title: #p freq=noraman PBEPBE/SDD
converged: YES YES YES YES
title: Mulliken charges:
elementType: O O N N C C C C C C C C H H H H H H H H H H
charge: -0.279064 -0.288643 -0.477422 -0.662604 0.516563 -0.589046 0.380315 -0.375803 -0.389941 -0.195288 0.264439 -0.535995 0.237227 0.307910 0.240260 0.220997 0.291708 0.221058 0.221058 0.242204 0.346155 0.303913
chargesum: 0.00000
title: Mulliken charges with hydrogens summed into heavy atoms:
elementType: O O N N C C C C C C C C
charge: -0.279064 -0.288643 -0.185713 -0.012536 0.516563 -0.351819 0.380315 -0.067893 -0.149681 0.025708 0.264439 0.148325
polarizability: 1.72100615e+02 -3.40910902e+00 1.12310650e+02 -8.13233955e-03 -4.24230082e-03 4.96017227e+01
1716.lowfreq: -10.2620 -0.0010 -0.0007 -0.0006 5.7156 6.6213 47.2777 60.0542 100.5797
frequency: 47.2318 60.0437 100.5721 139.2501 202.3812 226.7878 237.5799 266.2383 290.8470 301.7852 360.7973 452.5601 454.5347 489.5434 530.4752 563.4460 580.0439 622.9506 665.3800 690.1714 711.3204 766.9726 778.9757 858.7951 861.7517 886.2466 971.3202 981.3373 988.8639 1033.1279 1042.4302 1091.1277 1113.2490 1153.0538 1164.4675 1196.1903 1272.4057 1288.7519 1320.5112 1394.1982 1420.3778 1439.3418 1466.9895 1475.6774 1485.7881 1525.8696 1593.1064 1610.1882 1629.3824 1661.5395 2958.7331 3045.2123 3123.2310 3133.8306 3136.6079 3169.9177 3202.2070 3531.9834 3544.1810 3698.8275
redmass: 5.6912 3.3873 3.6364 4.6359 1.7022 2.4039 4.8582 1.6315 4.5000 1.5626 4.3273 5.4093 2.9344 1.1363 4.2325 4.1569 1.4136 2.8358 6.1825 2.0279 9.5057 6.6138 1.3716 4.2543 1.7690 1.3952 5.6966 1.2959 6.3574 2.1067 2.3068 1.5890 1.2594 1.4274 1.3631 1.4429 1.6671 3.7109 1.6951 7.5684 2.8715 1.2318 1.0499 1.0611 2.8289 2.4276 3.4003 1.6545 4.0987 3.7969 1.0330 1.1038 1.0993 1.0914 1.0886 1.0941 1.0950 1.0709 1.0507 1.1039
irintensity: 11.5362 12.3124 3.9632 10.5155 0.0025 3.1316 3.8182 0.0000 2.1418 33.0410 2.1778 0.5050 14.5446 292.0485 6.3791 24.3982 51.3624 28.3775 4.6044 35.4574 20.3637 3.8402 47.8411 3.5757 63.2764 13.9972 10.6729 4.5913 4.9585 66.4522 4.9179 16.1215 0.2743 32.6185 104.1278 63.0365 35.0896 99.1476 111.8606 233.2934 180.7354 8.1826 12.7260 15.7008 245.5424 296.0878 175.7262 78.0987 139.8649 274.3061 68.6456 51.0527 27.7895 13.6742 8.4104 11.1572 9.1718 14.2827 51.0034 41.5388
temp: 298.150 k
press: 1.00000 atm
elementType: 8 8 7 7 6 6 6 6 6 6 6 6 1 1 1 1 1 1 1 1 1 1
symmnumber: 1
zpe: 454645.0 jmol-1
zpe.correction: 0.173165 hartree
zpe.thermalcorrener: 0.184833 hartree
zpe.thermalcorrenthalpy: 0.185777 hartree
zpe.thermalcorrgfe: 0.135201 hartree
zpe.sumelectzpe: -569.925073 hartree
zpe.sumelectthermal: -569.913405 hartree
zpe.sumelectthermalent: -569.912461 hartree
zpe.sumelectthermalfe: -569.963038 hartree
dipole: -0.9799 -3.4683 -0.0001
dipole: 3.6040
quadrupole: -50.5435 -64.1826 -75.5038
quadrupole: -18.4737 -0.0020 0.0010
quadrupole: 12.8665 -0.7727 -12.0938 -18.4737 -0.0020 0.0010
hfenergy: -570.0982386 hartree
pointgroup: C01 [X(C8H10N2O2)]
dipole: 0.4129806 -1.3564679 0.0000334 debye
dipolederiv: -1.5753988 0.3294389 0.0001064 0.5801874 -0.4966988 -0.0000528 0.0001263 -0.000036 -0.3060808 -0.8717746 0.0745952 0.0000166 0.2660569 -0.9571003 0.0000631 0.0001261 -0.0001098 -0.3852267 -2.0855153 -0.2649775 0.0001201 0.0261284 -0.3171028 -0.0000263 0.0000573 0.00002 -0.3523218 -1.1953258 -0.5343894 -0.0000634 -0.6912173 -0.6740858 0.0000394 0.0000496 0.0000947 -0.7930015 1.3388237 0.2876688 -0.0000696 0.6923377 0.4206207 -0.0000021 -0.0000378 0.0000235 0.1159021 -0.7279832 0.0461554 0.0000357 0.0309601 -0.0124339 0.0000259 0.0000029 0.0000117 -0.2571191 1.26353 -0.3659612 -0.0001025 -0.7881679 0.5081979 0.0000825 -0.0001415 0.0000546 0.1189232 -0.3644646 -0.0872282 0.0000079 -0.3284528 -0.2937904 0.0000118 0.0000051 -0.000003 -0.2090169 -0.3276763 0.0031076 0.0000069 0.3444423 -0.301333 -0.0000285 0.0000356 -0.0000073 -0.2494391 0.3546764 0.0462079 -0.0000293 -0.0089365 0.1988505 0.0000297 -0.0000227 0.0000276 -0.1239167 2.6602442 0.3856724 -0.0001284 -0.1726562 1.4254447 -0.0000691 -0.0003524 -0.0000454 0.3408583 0.8715611 -0.0519716 -0.0000381 0.2437809 0.2000284 -0.0000264 -0.0000073 -0.000008 0.3289202 0.0892702 -0.0448814 0.0000027 -0.0382433 -0.0850862 -0.0000242 0.0000043 -0.0000219 0.1848561 0.1361613 0.0728787 0.0000087 0.0556086 0.1013732 -0.0000125 0.000003 -0.0000107 0.1929945 -0.0827779 -0.0745725 0.0000094 -0.0777339 0.0729296 -0.0000051 0.0000071 -0.0000048 0.1792688 0.0730423 -0.0120296 0.0000035 -0.0181792 -0.1246976 -0.0000231 0.0000014 -0.0000222 0.1479605 0.1117824 0.0255895 0.0000013 0.0001265 0.070912 -0.0000049 0.000001 -0.0000006 0.3172464 -0.017274 0.0064503 0.0021556 -0.1561224 0.0167475 -0.1246058 -0.0590772 -0.0969056 -0.0930179 -0.0172704 0.0064599 -0.0021596 -0.1561207 0.0167111 0.1246421 0.0590433 0.0969236 -0.0929867 -0.0576162 0.0949828 0.0000179 0.1557713 -0.0329241 -0.0000207 0.0000227 -0.0000173 0.1221382 0.2461995 0.0204276 0.0000408 -0.0047893 0.1620869 0.0000046 0.0000738 0.0000136 0.4035595 0.177786 0.0363762 0.0000572 0.0452193 0.1013505 0.0000023 0.0000794 0.0000234 0.4094994 unknown
polarizability: 171.9388129|4.6119403|112.4724523|-0.0082162|0.0040774|49.6017227 unknown
InChI: InChI=1S/C8H10N2O2/c1-12-7-4-2-3-6(5-7)10-8(9)11/h2-5,10H,9H2,1H3
charge 0 multiplicity 1
22 atoms
O  3.03486 -1.125205 -0.000469
O  -3.318477 0.974134 0.000092
N  -1.74292 -0.794653 -0.000139
N  -4.045847 -1.234097 0.000089
C  -0.507892 -0.087976 -0.000162
C  0.674412 -0.868023 -0.000308
C  1.940507 -0.241812 -0.000324
C  -0.421808 1.332608 -0.000038
C  2.045461 1.17085 -0.000201
C  0.853001 1.9307 -0.000063
C  -3.04209 -0.261161 -0.000139
C  4.37443 -0.535845 -0.000487
H  0.639267 -1.963939 -0.000413
H  -1.335619 1.92763 0.000056
H  3.016572 1.672918 -0.000215
H  0.921554 3.024563 0.000029
H  -1.653895 -1.812439 -0.00014
H  4.544854 0.08066 0.903801
H  4.544764 0.08081 -0.904689
H  5.065201 -1.391876 -0.000592
H  -5.003454 -0.892496 0.00032
H  -3.88008 -2.23815 0.00009
