program: Gaussian 09
title: 000101503
version: EM64L-G09RevD.01
frameworkgroup: C1[X(C11H15N3O2)]
method: RPBEPBE
basis: SDD
operation: Freq
keyword: #p
keyword: freq=noraman
keyword: PBEPBE/SDD
title: #p freq=noraman PBEPBE/SDD
converged: YES YES NO NO
title: Mulliken charges:
elementType: O O N N N C C C C C C C C C C C H H H H H H H H H H H H H H H
charge: -0.255101 -0.267980 -0.273129 -0.447085 -0.381975 0.462272 -0.513073 -0.339455 -0.453743 0.472185 -0.445491 -0.338517 0.218406 0.247161 -0.781804 -0.756262 0.245485 0.227250 0.255782 0.240186 0.215653 0.309056 0.295226 0.300246 0.311996 0.258650 0.258624 0.211602 0.256104 0.212424 0.255308
chargesum: 0.00000
title: Mulliken charges with hydrogens summed into heavy atoms:
elementType: O O N N N C C C C C C C C C C C
charge: -0.255101 -0.267980 0.022098 -0.146840 -0.069980 0.462272 -0.040338 -0.083673 -0.213557 0.472185 -0.229838 -0.029461 0.218406 0.247161 -0.052928 -0.032426
polarizability: 2.44813415e+02 -5.20042674e+00 1.40080363e+02 -1.27488376e+01 -4.01719678e+00 8.40114523e+01
1716.lowfreq: -12.0009 -4.5130 -0.0007 0.0007 0.0008 0.7235 16.0262 26.3456 43.2849
frequency: 15.6674 26.2835 43.2682 68.3201 69.9921 79.8643 85.1034 102.9283 131.2697 151.1367 199.4800 252.5935 278.9303 310.2430 353.9740 365.4492 400.5873 411.9106 439.0729 505.8142 519.1730 532.0540 596.4272 611.4532 617.5838 635.2425 642.7782 666.0319 709.6080 740.6349 801.2782 827.9472 843.9368 866.2025 912.9990 930.6869 950.6111 964.8431 977.5952 992.6767 992.9965 1010.6855 1039.0382 1039.5109 1067.6059 1117.1274 1129.8451 1187.6766 1209.4178 1216.6378 1222.0287 1262.4065 1271.4628 1308.2747 1335.5783 1381.0852 1385.4549 1388.4007 1409.5212 1429.7476 1449.1111 1449.6889 1468.7105 1470.4093 1482.3680 1484.4118 1496.5770 1512.4247 1593.9911 1617.2537 1623.1749 1628.7195 2966.1602 2994.6649 2996.7455 3023.5044 3095.8156 3098.4362 3098.5799 3101.3992 3106.5164 3131.4737 3154.1366 3196.2721 3391.6667 3533.8643 3547.1811
redmass: 5.0196 4.5924 4.0532 3.5852 1.6473 1.4298 3.5502 1.6155 2.9827 4.5235 3.6421 3.5649 3.8405 5.2848 3.6023 3.6680 4.0638 3.0087 3.6019 2.4511 1.6445 3.1192 3.2548 3.2378 2.7060 6.6366 1.1784 4.6207 2.0442 2.4046 3.4912 1.5982 3.7374 1.4547 3.4019 5.9003 1.3821 2.2278 1.7065 1.4827 1.4554 2.6532 1.6509 1.6318 2.7052 1.7409 2.0534 1.1369 1.3829 3.6146 2.0712 1.9797 2.2165 1.4451 1.5492 3.1486 1.2414 1.2501 3.6810 1.5401 1.0452 1.0458 1.1193 1.0951 1.2515 1.1084 1.7426 2.9065 6.0206 6.4303 4.9467 6.0414 1.0598 1.0362 1.0359 1.1021 1.1000 1.1002 1.0984 1.0986 1.0893 1.0911 1.0946 1.0944 1.0744 1.0764 1.0796
irintensity: 0.1468 1.2793 3.0626 9.8159 1.7808 1.1487 9.2542 2.4103 1.5830 4.7472 2.1061 14.6771 2.1839 7.9369 5.5515 0.8279 1.5798 0.1556 1.8402 10.8295 107.2040 30.6065 0.4098 2.6229 9.7306 1.4434 57.7546 6.4399 48.7361 31.6696 3.3600 45.7835 0.5933 36.2072 4.3071 3.5485 2.4385 7.9081 5.7795 9.9189 6.9800 5.5854 11.9925 16.0419 27.4641 11.3929 11.8198 6.9762 6.4745 53.1567 0.4023 39.8299 97.1182 51.3127 20.5488 149.4639 83.4148 36.2027 20.3620 144.5416 14.7972 15.3076 21.3561 21.2427 33.3463 21.4818 109.1631 305.1136 36.7369 133.0445 121.7649 55.8015 33.8634 14.4529 12.9483 20.0679 18.1937 18.5621 9.7545 9.5436 24.0547 11.1931 8.1148 5.2831 1.8458 11.1984 21.1681
temp: 298.150 k
press: 1.00000 atm
elementType: 8 8 7 7 7 6 6 6 6 6 6 6 6 6 6 6 1 1 1 1 1 1 1 1 1 1 1 1 1 1 1
symmnumber: 1
zpe: 656447.3 jmol-1
zpe.correction: 0.250028 hartree
zpe.thermalcorrener: 0.266825 hartree
zpe.thermalcorrenthalpy: 0.267769 hartree
zpe.thermalcorrgfe: 0.202411 hartree
zpe.sumelectzpe: -741.679005 hartree
zpe.sumelectthermal: -741.662208 hartree
zpe.sumelectthermalent: -741.661264 hartree
zpe.sumelectthermalfe: -741.726622 hartree
dipole: -0.7274 6.0382 0.3827
dipole: 6.0939
quadrupole: -67.4824 -97.9872 -96.2700
quadrupole: 4.6809 -9.8885 -2.9527
quadrupole: 19.7641 -10.7407 -9.0234 4.6809 -9.8885 -2.9527
hfenergy: -741.9290329 hartree
pointgroup: C01 [X(C11H15N3O2)]
dipole: -0.2012147 -2.3644064 0.3423043 debye
polarizability: 243.9081672|11.8371415|136.7811806|13.0906562|-14.4944267|88.2158816 unknown
InChI: InChI=1S/C11H15N3O2/c1-8(15)13-11-5-3-10(4-6-11)7-12-14-9(2)16/h3-6,12-14H,7H2,1-2H3
charge 0 multiplicity 1
31 atoms
O  4.483813 1.696118 -0.387746
O  -4.414582 1.385542 0.325491
N  -2.704065 -0.864334 0.428248
N  3.744238 -0.419157 0.319322
N  -4.112336 -0.91361 0.210441
C  -0.455484 -0.401636 -0.491909
C  -1.94408 -0.429771 -0.79486
C  0.188674 -1.529146 0.081262
C  0.327452 0.740597 -0.783319
C  2.348828 -0.361764 0.031833
C  1.570542 -1.511913 0.340594
C  1.716885 0.775855 -0.534961
C  4.721387 0.557912 0.113692
C  -4.910211 0.227288 0.17928
C  6.129033 0.149711 0.547392
C  -6.400243 -0.028034 -0.016889
H  -2.283309 0.563388 -1.154209
H  -2.169408 -1.17146 -1.58457
H  -0.407084 -2.413044 0.332286
H  -0.154987 1.627001 -1.212536
H  2.052033 -2.3937 0.784472
H  2.313481 1.659857 -0.765293
H  -2.517746 -0.208121 1.20517
H  4.06638 -1.297489 0.731402
H  -4.519719 -1.848669 0.167977
H  6.486938 0.859608 1.313056
H  6.808111 0.235154 -0.318247
H  6.197488 -0.874748 0.953574
H  -6.742779 0.522433 -0.9097
H  -6.650284 -1.096409 -0.138547
H  -6.954265 0.372744 0.849395
