program: Gaussian 09
title: 000101495
version: EM64L-G09RevD.01
frameworkgroup: C1[X(C7H12N5OPS)]
method: RPBEPBE
basis: SDD
operation: Freq
keyword: #p
keyword: freq=noraman
keyword: PBEPBE/SDD
title: #p freq=noraman PBEPBE/SDD
converged: YES YES NO NO
title: Mulliken charges:
elementType: S P O N N N N N C C C C C C C H H H H H H H H H H H H
charge: 0.207470 1.269688 -0.603700 -0.415994 -0.446151 -0.699432 -0.105790 -0.055626 -0.396645 -0.368000 -0.384324 -0.390172 -0.052212 -0.047816 -0.711062 0.250874 0.266829 0.259682 0.249821 0.317332 0.239598 0.250855 0.256088 0.360923 0.243002 0.242058 0.262703
chargesum: 0.00000
title: Mulliken charges with hydrogens summed into heavy atoms:
elementType: S P O N N N N N C C C C C C C
charge: 0.207470 1.269688 -0.603700 -0.415994 -0.446151 -0.338509 -0.105790 -0.055626 0.121058 0.141504 0.172606 0.116770 -0.052212 -0.047816 0.036701
polarizability: 1.96978015e+02 -4.13400697e+00 1.41704267e+02 5.08069770e+00 1.30745133e+01 1.26363997e+02
1716.lowfreq: -5.7346 -0.0019 -0.0007 0.0006 1.0316 10.5673 27.4782 42.1221 49.7531
frequency: 27.3875 42.0093 49.5494 59.9133 91.9119 106.9515 114.7082 130.0221 160.9890 175.7553 210.6846 211.9319 240.2203 259.6463 311.5071 339.3146 360.5565 371.5913 423.4283 483.7495 496.8160 514.0326 541.4023 544.5203 584.2281 622.1668 686.0023 720.7229 785.9528 800.4670 809.3287 815.2119 841.3562 886.9895 916.0903 937.1540 997.2076 1007.3751 1018.6859 1037.2018 1053.8505 1074.3055 1084.9461 1096.7760 1112.5646 1118.3839 1120.4207 1151.6084 1153.6297 1156.9104 1179.6628 1241.0862 1275.3273 1379.3434 1395.6502 1442.9896 1450.9723 1455.4402 1455.5817 1464.5340 1468.2540 1496.3441 1521.7275 2991.3407 3073.0766 3074.2956 3077.7029 3079.2371 3085.1866 3113.0575 3184.7157 3187.1970 3200.4374 3203.9646 3543.4109
redmass: 4.2387 7.0229 3.6892 3.5317 4.5003 3.6783 3.1501 1.2330 4.0777 3.2368 3.4148 6.0950 7.5030 4.7943 4.0653 5.4094 4.9258 5.0778 8.0923 7.1822 1.5385 5.4722 5.3118 5.5341 12.3390 6.0550 10.0502 8.3693 9.1257 8.7798 1.0931 1.0803 8.9053 4.6304 4.7904 2.8484 1.0561 1.2067 3.9088 1.4015 4.7275 1.2658 1.2611 3.1585 1.3283 1.3097 1.2947 1.3907 1.3828 1.2685 3.6743 3.3700 3.8563 1.4713 1.2384 1.1332 1.2871 1.0757 1.0507 1.1750 1.1659 3.9430 5.2355 1.0366 1.0984 1.0495 1.0500 1.0588 1.0602 1.0987 1.1185 1.1181 1.1187 1.1176 1.0770
irintensity: 0.1882 2.9489 3.3697 3.7238 1.4453 1.1672 0.0849 0.7922 16.0676 15.2326 0.9450 0.3836 8.0892 10.9227 3.3948 2.2367 5.0451 6.8197 80.0886 20.5370 45.3179 18.0008 21.3681 6.5797 3.9120 133.2646 34.4103 132.0807 54.9065 3.1580 19.1217 33.3476 13.7438 173.3961 121.1299 34.1318 0.9754 14.5219 70.6465 3.5548 80.2715 2.6865 4.9293 22.2247 6.3514 6.1776 9.4212 1.5304 1.7312 6.9228 54.8438 69.0972 91.9180 162.3780 2.0586 16.9657 28.5665 7.5358 21.5473 8.5087 2.1606 267.7192 190.0722 19.3222 12.0730 39.6719 14.9016 34.4744 25.4265 4.5992 14.4978 1.0842 3.4412 10.0397 71.2567
temp: 298.150 k
press: 1.00000 atm
elementType: 16 15 8 7 7 7 7 7 6 6 6 6 6 6 6 1 1 1 1 1 1 1 1 1 1 1 1
symmnumber: 1
zpe: 519769.5 jmol-1
zpe.correction: 0.197970 hartree
zpe.thermalcorrener: 0.214704 hartree
zpe.thermalcorrenthalpy: 0.215649 hartree
zpe.thermalcorrgfe: 0.151925 hartree
zpe.sumelectzpe: -1360.927513 hartree
zpe.sumelectthermal: -1360.910778 hartree
zpe.sumelectthermalent: -1360.909834 hartree
zpe.sumelectthermalfe: -1360.973558 hartree
dipole: 2.4935 -0.7406 1.1095
dipole: 2.8279
quadrupole: -95.3245 -95.9272 -106.1467
quadrupole: -3.7286 -12.8578 -4.4582
quadrupole: 3.8083 3.2056 -7.0139 -3.7286 -12.8578 -4.4582
hfenergy: -1361.1254827 hartree
pointgroup: C01 [X(C7H12N5O1P1S1)]
dipole: -1.0511322 -0.2578221 -0.2577843 debye
polarizability: 197.095374|-4.187051|134.6773744|-4.1069556|-15.1785641|133.2735303 unknown
InChI: InChI=1S/C7H12N5OPS/c1-6-8-9-7(15-6)10-14(13,11-2-3-11)12-4-5-12/h10H,2-5H2,1H3
charge 0 multiplicity 1
27 atoms
S  -2.618745 -0.544547 1.683081
P  1.826059 -0.278075 0.742457
O  2.797902 -0.670671 1.950603
N  1.638184 -1.414532 -0.614888
N  2.252397 1.1771 -0.10598
N  0.18208 -0.291516 1.487882
N  -1.188914 0.700138 -0.216239
N  -2.531643 0.845855 -0.600574
C  2.07524 -2.84932 -0.387374
C  2.897519 -1.939486 -1.281622
C  1.535669 1.883921 -1.22348
C  1.738614 2.563872 0.127763
C  -1.033833 0.00875 0.917596
C  -3.407219 0.303769 0.231841
C  -4.894461 0.349078 0.067161
H  1.404512 -3.591156 -0.829387
H  2.500514 -3.102579 0.592216
H  3.867349 -1.599058 -0.898809
H  2.817162 -2.019964 -2.369406
H  0.516349 1.554608 -1.453346
H  2.18923 2.143781 -2.062377
H  2.514881 3.323357 0.260035
H  0.8434 2.683039 0.750858
H  0.206705 -0.608909 2.460545
H  -5.326058 -0.665119 -0.01002
H  -5.381748 0.859019 0.91786
H  -5.129245 0.902545 -0.856398
