program: Gaussian 09
title: 000101467
version: EM64L-G09RevD.01
frameworkgroup: C1[X(C13H9N3O3S)]
method: RPBEPBE
basis: SDD
operation: Freq
keyword: #p
keyword: freq=noraman
keyword: PBEPBE/SDD
title: #p freq=noraman PBEPBE/SDD
converged: NO YES NO NO
title: Mulliken charges:
elementType: S O O O N N N C C C C C C C C C C C C C H H H H H H H H H
charge: 0.254252 -0.224703 -0.220976 -0.205610 -0.377238 -0.085893 0.049265 0.348038 0.292745 -0.237454 0.459254 -0.331683 -0.639134 0.269362 -0.312537 -0.452094 -0.332021 -0.195741 -0.219867 -0.253008 0.321934 0.280867 0.304182 0.292965 0.222443 0.301957 0.230755 0.227180 0.232758
chargesum: 0.00000
title: Mulliken charges with hydrogens summed into heavy atoms:
elementType: S O O O N N N C C C C C C C C C C C C C
charge: 0.254252 -0.224703 -0.220976 -0.205610 -0.055304 -0.085893 0.049265 0.348038 0.292745 -0.237454 0.459254 -0.050816 -0.334952 0.269362 -0.019572 -0.229651 -0.030064 0.035014 0.007313 -0.020250
polarizability: 3.88320122e+02 8.15904497e+00 2.35690222e+02 1.44967857e-01 1.50765976e-01 6.94779929e+01
1716.lowfreq: -7.6310 -4.2765 0.0016 0.0019 0.0022 2.1368 23.5878 32.6318 41.7975
frequency: 23.4752 32.6055 41.7937 60.9922 66.2152 101.6313 105.2641 169.2973 192.7387 211.1340 246.2471 254.8582 262.9823 303.5034 327.4766 408.9917 413.4524 459.1797 485.9562 521.6013 543.2726 547.6594 561.4759 562.8815 579.8538 613.3693 616.4593 675.2686 685.9809 697.9698 732.6919 740.6575 763.2533 765.7195 806.6115 816.6811 821.3721 839.2210 849.2075 905.2465 914.6335 916.3841 932.4672 973.0585 985.0127 998.6481 1012.9035 1025.9203 1039.3539 1088.4998 1129.2433 1144.0180 1173.8208 1182.6782 1190.7267 1201.8609 1248.5875 1270.0303 1324.6550 1334.7546 1342.2175 1359.0199 1384.8150 1435.1611 1442.3532 1483.6697 1515.1699 1521.4044 1587.9082 1604.3100 1612.8811 1622.3475 3110.8402 3135.1930 3147.4757 3168.5177 3190.8891 3244.0081 3251.5175 3261.7903 3546.5812
redmass: 7.0643 4.0043 7.4399 13.5676 5.8978 8.8233 7.5471 9.5402 6.4042 5.0205 8.8640 10.5511 3.8339 6.9076 7.8254 2.9183 7.4193 9.7109 2.2960 10.7984 5.9324 8.2283 4.0604 1.6405 7.4018 5.9363 6.5813 7.9882 2.9814 2.0757 12.9000 7.5342 1.5980 1.5690 6.7419 5.8209 1.3640 1.2664 7.0561 1.3840 1.4167 8.5514 6.4838 1.3551 6.1306 1.3087 1.4670 2.1810 2.1266 1.5830 4.2745 2.6178 1.0591 3.2884 1.1197 1.6300 2.9031 5.7150 1.4551 6.1524 8.0010 5.6821 6.5535 2.4686 6.1049 2.3626 4.2082 2.0213 9.0253 4.4993 6.4674 9.3022 1.0891 1.0868 1.0932 1.0995 1.0952 1.0947 1.0960 1.1045 1.0762
irintensity: 2.6189 0.1521 0.8573 0.0030 1.1954 2.1169 4.2528 1.4631 2.6641 0.1995 1.0410 3.4886 8.2995 0.2810 1.1610 0.0014 10.1382 0.0301 55.0440 30.9005 0.3721 1.1226 1.1874 34.4018 0.9969 5.4401 0.2147 10.0973 2.4342 35.8174 7.8427 38.0481 0.7982 164.9874 22.1220 8.7303 48.7452 0.1445 1.0767 3.7708 11.4382 11.2183 4.5284 0.1221 0.1019 2.1055 61.6603 8.6975 25.6643 16.1147 83.3856 71.5839 0.1262 32.2232 4.3252 75.9114 315.9062 297.2263 17.3794 36.1515 117.3931 50.5538 36.6881 91.1560 24.9160 99.9689 214.1915 63.0544 274.0942 3.9285 362.3851 432.1016 13.0457 0.2201 25.1061 24.0031 10.3136 0.0319 13.5763 4.7995 55.0033
temp: 298.150 k
press: 1.00000 atm
elementType: 16 8 8 8 7 7 7 6 6 6 6 6 6 6 6 6 6 6 6 6 1 1 1 1 1 1 1 1 1
symmnumber: 1
zpe: 525576.8 jmol-1
zpe.correction: 0.200182 hartree
zpe.thermalcorrener: 0.216948 hartree
zpe.thermalcorrenthalpy: 0.217892 hartree
zpe.thermalcorrgfe: 0.152928 hartree
zpe.sumelectzpe: -1287.260946 hartree
zpe.sumelectthermal: -1287.244181 hartree
zpe.sumelectthermalent: -1287.243236 hartree
zpe.sumelectthermalfe: -1287.308200 hartree
dipole: 8.5653 0.3624 -0.0070
dipole: 8.5730
quadrupole: -149.6970 -107.3921 -126.9492
quadrupole: 5.1335 0.1313 0.0275
quadrupole: -21.6842 20.6207 1.0635 5.1335 0.1313 0.0275
hfenergy: -1287.4611281 hartree
pointgroup: C01 [X(C13H9N3O3S1)]
dipole: -3.3686115 -0.1623324 0.0491605 debye
polarizability: 388.15045|8.9171527|235.269585|-4.7011615|-9.4198625|70.0683023 unknown
InChI: InChI=1S/C13H9N3O3S/c17-16(18)12-7-6-11(19-12)10-8-20-13(15-10)14-9-4-2-1-3-5-9/h1-8,14H
charge 0 multiplicity 1
29 atoms
S  -0.67539 -3.172828 0.190929
O  3.139931 -0.496342 -0.005193
O  6.123429 1.488141 -0.148895
O  5.838166 -0.793355 -0.016382
N  -2.832495 -1.390556 0.115776
N  -0.582598 -0.4813 0.035661
N  5.386705 0.417721 -0.080779
C  0.74333 -0.957927 0.047895
C  1.822338 0.003909 -0.018896
C  -1.459302 -1.468432 0.103077
C  -3.659464 -0.229899 0.064926
C  1.848181 1.401699 -0.097852
C  0.904738 -2.336441 0.124415
C  3.972057 0.62928 -0.077537
C  3.222553 1.80108 -0.135323
C  -5.064938 -0.437858 0.104226
C  -3.140407 1.087813 -0.021621
C  -5.94332 0.662246 0.058232
C  -4.035774 2.17834 -0.066618
C  -5.434427 1.979677 -0.027308
H  -3.333221 -2.279039 0.172512
H  0.970176 2.041457 -0.124306
H  1.83373 -2.900958 0.14503
H  3.628936 2.807008 -0.196339
H  -5.468823 -1.45672 0.170249
H  -2.060044 1.237519 -0.052053
H  -7.024553 0.489949 0.089072
H  -3.631438 3.194537 -0.132814
H  -6.117776 2.83428 -0.062582
