program: Gaussian 09
title: 000101544
version: EM64L-G09RevD.01
frameworkgroup: C1[X(C9H14N3O8P)]
method: RPBEPBE
basis: SDD
operation: Freq
keyword: #p
keyword: freq=noraman
keyword: PBEPBE/SDD
title: #p freq=noraman PBEPBE/SDD
converged: YES YES NO NO
title: Mulliken charges:
elementType: P O O O O O O O O N N N C C C C C C C C C H H H H H H H H H H H H H H
charge: 1.405294 -0.261012 -0.541135 -0.434444 -0.450659 -0.699706 -0.672220 -0.387228 -0.605654 -0.210674 -0.043053 -0.617062 -0.185869 -0.133063 -0.032456 -0.049125 -0.383133 -0.057655 0.123129 -0.368981 0.204413 0.308037 0.225183 0.298290 0.288368 0.210299 0.227495 0.381870 0.345532 0.355784 0.238069 0.437520 0.412143 0.324948 0.346752
chargesum: 0.00000
title: Mulliken charges with hydrogens summed into heavy atoms:
elementType: P O O O O O O O O N N N C C C C C C C C C
charge: 1.405294 -0.261012 -0.541135 -0.052574 -0.094875 -0.262186 -0.260077 -0.387228 -0.605654 -0.210674 -0.043053 0.054638 0.122168 0.092120 0.265834 0.239244 0.054661 0.287877 0.123129 -0.130912 0.204413
polarizability: 2.15319882e+02 -8.36919985e+00 1.83263887e+02 2.14605945e+01 2.26333769e+00 1.12720826e+02
1716.lowfreq: -6.6899 -2.9842 0.0012 0.0015 0.0017 3.8585 20.8645 40.4730 54.2265
frequency: 20.6850 40.4629 54.2227 61.4155 86.0305 109.1161 120.9555 136.0855 143.4936 164.1576 186.1844 188.0615 208.7524 239.5877 251.1212 262.5725 274.6333 298.3333 312.2091 314.2926 329.0079 341.0983 354.4551 373.6887 381.7612 413.0367 452.0539 463.3404 473.1370 505.4269 520.2846 538.0302 581.2173 585.1674 593.0322 678.3218 689.9314 698.3916 722.8504 744.0043 755.4387 760.4127 797.0670 797.3840 814.1272 846.0176 874.5853 904.7326 944.7633 958.6789 973.8752 980.5517 993.0876 1005.6820 1014.1227 1021.0294 1033.8055 1044.6678 1067.8528 1075.6341 1097.6616 1105.3444 1161.1548 1182.2666 1200.3327 1229.6567 1238.9633 1248.2318 1263.8370 1270.3149 1278.1911 1292.8975 1323.9879 1332.2044 1338.5225 1346.1109 1373.2520 1383.9878 1417.4735 1469.3140 1470.9598 1509.8811 1576.8860 1625.9525 1634.5402 2781.6782 2939.6639 2977.5421 3003.4826 3025.0785 3076.0632 3102.6982 3130.6631 3184.2491 3462.2310 3539.4306 3580.6047 3580.6659 3695.7013
redmass: 7.6268 7.0943 8.0503 5.1589 6.4593 7.0614 6.9676 5.6316 5.0691 6.3819 5.0835 4.4809 6.2414 6.4642 1.9800 4.0920 1.1337 3.7918 5.5992 3.8842 4.9902 5.8093 4.5196 6.0452 9.5015 6.3784 2.9503 1.2054 1.3786 3.8455 4.8076 3.2163 1.4361 4.0929 6.9075 9.0096 5.7934 3.4666 5.3080 7.9197 6.7646 7.2436 2.2586 2.3473 13.4650 5.3824 3.5810 1.0952 2.7682 5.3634 2.3758 3.2444 1.7370 1.5601 2.8749 3.4081 3.3750 4.8182 2.6295 2.3962 3.3730 2.9941 1.7341 1.1423 1.2033 2.2365 1.6694 1.3379 1.3773 1.2352 1.4040 1.3513 1.1949 1.2762 1.2655 1.3662 1.8513 1.6161 1.4227 1.4974 2.1326 4.1746 3.1130 2.5319 2.8674 1.0730 1.0590 1.0860 1.1018 1.0862 1.0870 1.0888 1.0963 1.0960 1.0645 1.0456 1.0662 1.0664 1.1045
irintensity: 6.2859 0.3636 3.1930 4.9581 5.3839 5.8551 9.6720 6.7539 2.1312 19.4323 12.6387 17.9510 16.1253 20.8162 62.9257 4.6596 162.1851 12.7551 4.3999 25.7610 16.4137 3.3030 9.0321 4.4750 35.8096 21.2474 1.6218 121.2162 137.7054 22.1452 7.6176 50.1104 137.6676 47.6589 14.1207 14.6328 15.6659 0.6916 16.3139 268.1300 37.4897 34.0646 26.6743 60.4073 141.7034 16.0685 28.7414 159.2506 6.7337 63.6876 18.3646 71.0365 159.7361 15.8919 85.0342 42.8871 52.9190 92.4821 46.5337 22.0915 13.4571 129.2083 21.6868 17.2783 28.7700 53.8306 15.6825 15.2787 160.9197 502.3226 6.8641 71.6644 74.4047 28.5936 5.3531 13.3203 35.5972 11.2131 1.3107 44.0889 136.9628 152.9867 332.8218 203.5984 778.9657 1676.9839 44.4429 44.8313 55.7958 17.1232 2.8852 13.6073 60.1109 4.7053 53.4207 132.0437 88.1331 16.2449 43.3345
temp: 298.150 k
press: 1.00000 atm
elementType: 15 8 8 8 8 8 8 8 8 7 7 7 6 6 6 6 6 6 6 6 6 1 1 1 1 1 1 1 1 1 1 1 1 1 1
symmnumber: 1
zpe: 664081.8 jmol-1
zpe.correction: 0.252935 hartree
zpe.thermalcorrener: 0.273944 hartree
zpe.thermalcorrenthalpy: 0.274888 hartree
zpe.thermalcorrgfe: 0.203041 hartree
zpe.sumelectzpe: -1457.010644 hartree
zpe.sumelectthermal: -1456.989636 hartree
zpe.sumelectthermalent: -1456.988691 hartree
zpe.sumelectthermalfe: -1457.060539 hartree
dipole: 8.0710 1.8722 2.5550
dipole: 8.6703
quadrupole: -101.4105 -127.3560 -136.6803
quadrupole: -5.4638 19.5527 13.9675
quadrupole: 20.4051 -5.5404 -14.8647 -5.4638 19.5527 13.9675
hfenergy: -1457.2635799 hartree
pointgroup: C01 [X(C9H14N3O8P1)]
dipole: 2.5595814 -2.0150964 -1.0118861 debye
polarizability: 210.3054399|-8.451383|183.3424498|-30.7832273|-0.9319146|117.656705 unknown
InChI: InChI=1S/C9H14N3O8P/c10-5-1-2-12(9(15)11-5)8-7(20-21(16,17)18)6(14)4(3-13)19-8/h1-2,4,6-8,13-14,16-17H,3,10H2
charge 0 multiplicity 1
35 atoms
P  -2.397681 2.219693 -0.805807
O  -0.134443 -1.78461 1.307323
O  -2.266871 0.869369 0.326217
O  -3.15896 -1.406301 1.274096
O  0.634945 -4.029095 -0.220727
O  -1.486869 3.475515 -0.150207
O  -3.968072 2.764444 -0.428228
O  0.573618 2.158163 0.373892
O  -2.14688 1.721425 -2.289461
N  1.137013 -0.081158 0.185272
N  2.640625 1.64027 -0.602948
N  4.683625 1.082205 -1.547827
C  -1.415823 -0.256282 -0.068046
C  -2.233525 -1.565493 0.165863
C  -0.173386 -0.405215 0.869008
C  -1.155343 -2.584923 0.563437
C  -0.559896 -3.29599 -0.661661
C  2.044708 -1.067163 -0.142898
C  1.448084 1.310198 -0.019932
C  3.253085 -0.736035 -0.731184
C  3.516871 0.663882 -0.960371
H  -1.118077 -0.157451 -1.128822
H  -2.779205 -1.851083 -0.757331
H  -0.26085 0.269718 1.735774
H  -1.533782 -3.316854 1.292796
H  -0.29374 -2.566869 -1.458049
H  -1.331813 -3.984552 -1.063467
H  -3.442772 -0.449938 1.276508
H  1.757694 -2.096006 0.1034
H  0.878406 -4.704644 -0.901318
H  3.97308 -1.515394 -0.987095
H  -0.521898 3.16661 0.077626
H  -3.967142 3.632482 0.052515
H  5.399818 0.427369 -1.849874
H  4.819358 2.084013 -1.678173
