program: Gaussian 09
title: 000101408
version: EM64L-G09RevD.01
frameworkgroup: C1[X(C5H15N2O2P)]
method: RPBEPBE
basis: SDD
operation: Freq
keyword: #p
keyword: freq=noraman
keyword: PBEPBE/SDD
title: #p freq=noraman PBEPBE/SDD
converged: YES YES NO NO
title: Mulliken charges:
elementType: P O O N N C C C C C H H H H H H H H H H H H H H H
charge: 1.388001 -0.517856 -0.631586 -0.484862 -0.494871 -0.566573 -0.578381 -0.565831 -0.573255 -0.487296 0.216475 0.256657 0.223174 0.218431 0.212411 0.275828 0.245605 0.229359 0.222943 0.218727 0.218204 0.272360 0.229851 0.255521 0.216964
chargesum: 0.00000
title: Mulliken charges with hydrogens summed into heavy atoms:
elementType: P O O N N C C C C C
charge: 1.388001 -0.517856 -0.631586 -0.484862 -0.494871 0.129733 0.128289 0.132076 0.136037 0.215040
polarizability: 1.04758028e+02 3.50671533e-01 1.01910226e+02 -1.19815798e+00 1.04083463e+00 8.57111061e+01
1716.lowfreq: -15.3444 0.0012 0.0018 0.0020 9.2646 14.7927 46.1114 67.9327 81.7310
frequency: 45.8453 67.5012 81.4963 98.8997 109.4739 120.1072 162.3933 167.7433 183.2347 184.8289 200.7621 216.3366 266.4789 284.6023 316.1851 326.7412 354.5001 396.2189 418.4298 445.4678 560.8229 665.9086 693.0436 959.0657 968.1389 979.6993 1022.1207 1059.0655 1067.4883 1093.1087 1095.7062 1118.4737 1135.0021 1136.6535 1136.9661 1194.5320 1213.8895 1271.2059 1279.4654 1417.1648 1422.3507 1426.5647 1433.7001 1439.2942 1462.0726 1462.5272 1470.2133 1476.1615 1477.5380 1478.6062 1480.7431 1481.0710 1495.2052 1498.8171 2939.3374 2940.2546 2943.8322 2946.6585 2972.3816 3014.3182 3017.5443 3021.9285 3025.1838 3070.7375 3090.2928 3092.0576 3094.1317 3111.1619 3122.7852
redmass: 2.6411 2.9676 2.5422 1.8996 1.1428 2.0161 1.4131 1.6592 1.6442 1.3380 1.5593 1.8818 3.4983 4.2060 3.2200 3.1437 3.7124 5.1015 3.8504 3.9524 5.5497 8.3475 6.9471 3.7081 2.8866 6.9769 7.0958 1.3844 1.3465 1.2139 1.2144 1.2408 1.3465 1.3232 1.3510 5.7286 6.5443 2.2393 2.2199 1.1228 1.1226 1.1189 1.1411 1.1435 1.0444 1.0530 1.0441 1.0499 1.0488 1.0489 1.0478 1.0492 1.0588 1.0572 1.0373 1.0408 1.0388 1.0393 1.0303 1.0992 1.1001 1.0961 1.0973 1.1037 1.0976 1.0969 1.0969 1.1033 1.0956
irintensity: 0.8422 3.8096 1.5931 3.0539 0.8878 2.6373 1.7098 0.6389 3.6850 0.3449 1.1231 6.3413 24.7259 9.3581 12.5281 14.1587 3.0868 16.6822 12.9062 6.4261 15.1623 127.7070 110.6678 213.3856 232.8982 74.5747 122.4011 8.8743 8.1443 0.3008 0.0300 0.6690 0.0404 0.6822 0.2672 56.7622 46.1495 13.3239 16.5823 11.8036 9.7820 9.3887 1.0784 2.5032 2.1699 11.6927 2.8399 2.3125 5.6645 54.6209 45.4064 10.4804 2.6649 2.5758 60.7508 45.1247 234.2581 48.4501 64.2808 97.1995 0.6453 82.2234 3.6495 31.9437 20.3913 2.0134 7.7035 19.3782 4.1398
temp: 298.150 k
press: 1.00000 atm
elementType: 15 8 8 7 7 6 6 6 6 6 1 1 1 1 1 1 1 1 1 1 1 1 1 1 1
symmnumber: 1
zpe: 546826.4 jmol-1
zpe.correction: 0.208275 hartree
zpe.thermalcorrener: 0.223019 hartree
zpe.thermalcorrenthalpy: 0.223964 hartree
zpe.thermalcorrgfe: 0.166953 hartree
zpe.sumelectzpe: -799.816000 hartree
zpe.sumelectthermal: -799.801255 hartree
zpe.sumelectthermalent: -799.800311 hartree
zpe.sumelectthermalfe: -799.857322 hartree
dipole: -0.0440 -1.4138 -2.5983
dipole: 2.9584
quadrupole: -61.7724 -62.5194 -78.3315
quadrupole: -1.1543 2.0652 -2.0356
quadrupole: 5.7687 5.0217 -10.7904 -1.1543 2.0652 -2.0356
hfenergy: -800.0242748 hartree
pointgroup: C01 [X(C5H15N2O2P1)]
dipole: -0.011782 -0.5645966 1.0177488 debye
dipolederiv: 2.2452924 -0.1443683 0.0920018 -0.005302 2.1164628 -0.1256455 0.063286 0.0963433 1.3947632 -0.8188838 -0.3539612 -0.0904226 -0.3250592 -1.2575957 -0.1065097 -0.0498796 -0.2500988 -0.5834444 -0.7797638 0.0136697 0.0408182 -0.0249408 -0.7208415 0.0567596 0.0587331 0.0393894 -0.7598571 -0.9087292 0.2554304 0.0231158 0.2077533 -0.850056 0.1192651 -0.0330122 0.1598501 -0.8155183 -1.1231574 -0.0140123 -0.0166979 -0.0396394 -0.8178808 -0.0511329 0.0526967 -0.0522954 -0.5791784 0.1141832 0.1236134 0.0874426 0.0787313 0.2636775 -0.0956189 0.2289915 -0.2484955 0.4424374 0.515115 -0.168821 -0.065674 -0.0339323 0.2197919 0.145131 -0.2041402 0.2761064 0.0953227 0.2211469 0.1596999 0.0978588 0.3557356 0.3592802 0.0098254 0.2239463 0.0389495 0.2715636 0.4010933 -0.1970041 -0.0429011 -0.4262455 0.1858261 -0.0043868 -0.0274768 -0.0180197 0.2709658 0.490575 0.3846296 0.0846336 0.1989188 0.5466875 0.0489176 -0.0599194 -0.1686932 0.147035 0.0962684 -0.003506 -0.035034 0.0034599 -0.2246647 0.0775017 -0.0274024 0.0063544 0.0260666 -0.0034475 0.0256317 0.1141304 0.0448795 0.1014048 -0.0564754 0.0809374 -0.0275359 0.0597235 -0.1233614 -0.0126556 -0.1909974 -0.0729457 0.0436379 -0.0158354 -0.1075777 0.0499637 -0.0590854 0.0101814 0.0055018 0.0276357 0.0695988 -0.224175 -0.0852397 0.0189581 -0.032513 0.097872 -0.2360861 0.0301814 -0.0295985 -0.0329548 0.0476409 -0.0612069 -0.1274081 -0.0408432 0.0328598 0.1379079 -0.0140553 -0.0295979 -0.0488627 0.1269037 0.0890885 0.0237912 0.0327976 -0.0123618 0.0384504 0.1435855 0.0425347 0.0941513 0.0001689 -0.0304372 0.0215102 -0.0433845 0.0888919 -0.0755017 -0.0722489 -0.1357773 0.0033938 0.0268537 0.0505873 -0.1877769 -0.0333019 -0.0934003 -0.0462521 -0.1303646 0.074416 -0.1006746 0.0213497 0.038122 0.1162723 0.0827001 -0.0592612 -0.0971601 0.0165899 0.1280805 -0.0433398 0.0459565 0.1021184 0.1428518 0.0556074 -0.0517856 -0.12339 0.1164709 -0.0646947 0.0890134 0.0428692 0.0105951 -0.175367 0.0713955 -0.0815453 0.1459882 -0.0735058 -0.0492195 -0.0229915 -0.0269369 -0.0540988 -0.0394786 -0.0415355 0.1014175 0.059776 -0.0093704 0.0308686 -0.0148075 -0.1248418 -0.1052442 0.0157944 -0.1248766 0.0536837 0.0582249 -0.03921 -0.029079 -0.0167797 0.0871645 0.0169722 0.033436 0.1324857 -0.0645764 -0.1984699 -0.0419207 -0.0638427 0.0628398 0.0113166 0.0269475 -0.0417658 0.03965 0.0774116 unknown
polarizability: 104.1713252|-0.8917116|102.1770922|-2.8688298|-0.4577863|86.0309424 unknown
InChI: InChI=1S/C5H15N2O2P/c1-6(2)10(8,9-5)7(3)4/h1-5H3
charge 0 multiplicity 1
25 atoms
P  0.157041 0.264678 -0.397691
O  0.417195 1.599015 0.718335
O  0.470333 0.674325 -1.915422
N  1.105622 -1.108264 0.077388
N  -1.435157 -0.155906 0.157144
C  1.068907 -1.624216 1.454266
C  2.218127 -1.559448 -0.774186
C  -2.027125 -1.423924 -0.312559
C  -2.414171 0.879887 0.54085
C  1.42757 2.602037 0.325839
H  1.017805 -2.730942 1.441838
H  0.175897 -1.239572 1.973943
H  1.970064 -1.323618 2.028553
H  2.160332 -2.65557 -0.924946
H  3.203692 -1.321127 -0.321812
H  2.145804 -1.061208 -1.755409
H  -1.231098 -2.146566 -0.558178
H  -2.664353 -1.279856 -1.210606
H  -2.65221 -1.854312 0.493156
H  -3.048088 0.486046 1.358615
H  -3.074654 1.165309 -0.305521
H  -1.885475 1.771386 0.908009
H  1.191147 3.502922 0.91367
H  1.367027 2.819444 -0.756033
H  2.444667 2.247882 0.578559
