program: Gaussian 09
title: 000101414
version: EM64L-G09RevD.01
frameworkgroup: C1[X(C10H14N3OP)]
method: RPBEPBE
basis: SDD
operation: Freq
keyword: #p
keyword: freq=noraman
keyword: PBEPBE/SDD
title: #p freq=noraman PBEPBE/SDD
converged: YES YES NO NO
title: Mulliken charges:
elementType: P O N N N C C C C C C C C C C H H H H H H H H H H H H H H
charge: 1.191898 -0.617136 -0.434636 -0.384523 -0.850967 -0.406643 -0.367278 -0.404580 -0.384004 0.533014 -0.421361 -0.386428 -0.195349 -0.217802 -0.263781 0.252869 0.275915 0.245367 0.250897 0.248860 0.273528 0.261174 0.251655 0.355529 0.221049 0.299066 0.223141 0.223977 0.226549
chargesum: 0.00000
title: Mulliken charges with hydrogens summed into heavy atoms:
elementType: P O N N N C C C C C C C C C C
charge: 1.191898 -0.617136 -0.434636 -0.384523 -0.495438 0.122141 0.128986 0.117807 0.128825 0.533014 -0.200312 -0.087362 0.027793 0.006175 -0.037232
polarizability: 2.05634762e+02 -3.71716396e+00 1.27798012e+02 -1.16071247e+00 1.13391972e+01 1.23991556e+02
1716.lowfreq: -9.4776 -5.8333 0.0019 0.0024 0.0025 7.4177 24.5965 39.5266 45.2104
frequency: 24.4276 39.4349 45.1178 61.2276 90.0054 120.4030 144.3390 171.1638 182.6572 225.3321 257.8753 268.3782 315.6151 336.7927 385.8074 407.1370 445.4672 497.2369 528.0097 542.5160 587.6843 613.9394 630.1497 698.0269 755.5796 766.6500 780.0009 799.2582 807.4852 813.0356 836.4709 876.0092 885.9368 894.5520 905.7912 966.6457 981.7686 989.4390 992.6695 997.7363 1002.4511 1030.1630 1071.9047 1079.3872 1087.2171 1112.5820 1114.2118 1120.0030 1121.5517 1152.0172 1155.1761 1170.4164 1192.8674 1232.3835 1241.3382 1251.4518 1316.4439 1361.2413 1401.8262 1450.3600 1453.3070 1464.1806 1466.8234 1468.0142 1489.1111 1593.0791 1617.2010 3075.5271 3077.5486 3082.9608 3084.1134 3115.2852 3126.2528 3138.5512 3147.0904 3165.3339 3184.7752 3185.8279 3201.1531 3203.1178 3539.7823
redmass: 4.3768 3.7649 3.3653 3.0981 4.4970 2.9114 4.2698 5.3015 4.5913 4.3008 4.6411 5.2272 3.8037 4.5037 5.2254 2.9595 5.7172 1.9417 3.7923 2.6908 5.0218 6.5509 5.2214 1.9210 3.6591 2.1775 8.2193 3.3508 1.3507 1.1488 1.2697 4.1713 4.8741 4.7212 1.4723 1.3754 4.1845 1.4107 1.0837 1.0640 9.2404 2.1845 1.2608 1.2614 1.5703 1.3312 1.3129 1.2805 1.3400 1.3965 1.3867 1.0498 1.1175 3.2622 2.8092 2.0864 1.7425 1.8786 3.0481 1.0806 1.0753 1.9267 1.2171 1.1838 2.4811 5.9509 6.0200 1.0499 1.0491 1.0597 1.0612 1.0870 1.0867 1.0923 1.0961 1.1013 1.1180 1.1177 1.1176 1.1175 1.0754
irintensity: 0.7892 0.8648 2.3838 0.6991 1.3963 1.3659 2.8564 23.7503 16.8659 4.1114 1.2011 0.4968 0.7741 1.1172 6.5326 0.2710 29.3660 39.0140 34.4683 26.8397 56.7929 9.6519 111.5045 41.0600 19.6808 92.0464 9.3303 20.9516 16.8800 25.7807 0.9070 102.1548 116.2376 241.8686 28.5353 0.1610 3.7802 5.0401 1.9427 3.4781 54.7293 24.4314 3.1611 9.9745 14.8202 3.9177 8.9550 15.4478 3.9834 0.0507 0.3901 0.9597 2.6588 52.0764 88.0809 6.2889 105.1799 82.2500 38.2017 7.0736 7.1614 12.3685 1.2771 5.0485 185.1586 6.0737 151.2768 11.1050 15.9673 31.8078 17.9647 11.7698 2.3666 21.3941 13.0696 30.6964 1.1391 1.9866 10.9125 12.7687 38.1030
temp: 298.150 k
press: 1.00000 atm
elementType: 15 8 7 7 7 6 6 6 6 6 6 6 6 6 6 1 1 1 1 1 1 1 1 1 1 1 1 1 1
symmnumber: 1
zpe: 599399.7 jmol-1
zpe.correction: 0.228299 hartree
zpe.thermalcorrener: 0.243578 hartree
zpe.thermalcorrenthalpy: 0.244522 hartree
zpe.thermalcorrgfe: 0.183990 hartree
zpe.sumelectzpe: -968.940519 hartree
zpe.sumelectthermal: -968.925241 hartree
zpe.sumelectthermalent: -968.924297 hartree
zpe.sumelectthermalfe: -968.984828 hartree
dipole: 1.6150 0.2976 -1.5153
dipole: 2.2345
quadrupole: -83.2082 -88.5054 -100.6701
quadrupole: -1.6501 1.7653 2.5670
quadrupole: 7.5864 2.2891 -9.8755 -1.6501 1.7653 2.5670
hfenergy: -969.1688185 hartree
pointgroup: C01 [X(C10H14N3O1P1)]
dipole: 0.638439 0.0282959 -0.6036933 debye
polarizability: 204.8840379|-8.4244012|130.3913672|-0.1653964|10.900548|122.1489249 unknown
InChI: InChI=1S/C10H14N3OP/c14-15(12-6-7-12,13-8-9-13)11-10-4-2-1-3-5-10/h1-5,11H,6-9H2
charge 0 multiplicity 1
29 atoms
P  1.328333 -0.152627 0.156068
O  1.288011 0.24273 1.716495
N  2.398517 -1.482543 -0.355996
N  1.861084 1.167866 -0.943361
N  -0.144988 -0.772532 -0.518274
C  2.956193 -2.387803 0.727981
C  3.867961 -1.416397 0.000587
C  2.528294 2.372659 -0.29117
C  1.119005 2.492347 -0.833404
C  -1.480622 -0.413831 -0.19645
C  -2.524323 -0.837359 -1.064074
C  -1.801135 0.341033 0.965804
C  -3.865517 -0.509871 -0.774312
C  -3.146965 0.669287 1.234122
C  -4.188318 0.251369 0.372954
H  2.960458 -3.448009 0.460059
H  2.692439 -2.151428 1.766405
H  4.232721 -0.550957 0.56761
H  4.531951 -1.77169 -0.792525
H  3.371785 2.770617 -0.862827
H  2.641157 2.353932 0.800225
H  0.305012 2.579576 -0.103378
H  0.939927 2.974298 -1.798897
H  -0.003536 -1.423325 -1.295154
H  -2.282968 -1.417477 -1.963718
H  -1.006184 0.630733 1.661565
H  -4.658247 -0.846629 -1.452216
H  -3.382371 1.24731 2.135316
H  -5.229775 0.50732 0.59406
