program: Gaussian 09
title: 000101388
version: EM64L-G09RevD.01
frameworkgroup: C1[X(C9H9N3O4)]
method: RPBEPBE
basis: SDD
operation: Freq
keyword: #pfreq=noraman
keyword: PBEPBE/SDD
title: #p freq=noraman PBEPBE/SDD
converged: YES YES NO YES
title: Mulliken charges:
elementType: O O O O N N N C C C C C C C C C H H H H H H H H H
charge: -0.250668 -0.444660 -0.250492 -0.230170 -0.471006 -0.168751 0.037078 0.495274 -0.333067 -0.430615 0.265279 -0.351615 -0.303963 0.323667 0.109183 -0.621898 0.302964 0.234680 0.273449 0.277291 0.353143 0.260587 0.260613 0.278557 0.385139
chargesum: 0.00000
title: Mulliken charges with hydrogens summed into heavy atoms:
elementType: O O O O N N N C C C C C C C C C
charge: -0.250668 -0.059520 -0.250492 -0.230170 -0.117862 -0.168751 0.037078 0.495274 -0.030103 -0.195936 0.265279 -0.078166 -0.026673 0.323667 0.109183 0.177859
polarizability: 2.58678119e+02 6.46943518e+00 1.40576170e+02 4.48460527e-03 9.18461918e-04 5.68429212e+01
1716.lowfreq: -7.7852 -0.0009 -0.0005 0.0003 3.2424 4.1751 37.1909 45.8512 79.4792
frequency: 37.1626 45.8494 79.4743 81.9994 97.4010 127.6165 134.2708 167.5455 208.1602 208.2657 296.6581 308.6136 311.4393 365.8089 391.5273 412.6650 419.3179 478.0490 499.2546 507.9431 588.2639 589.0610 629.8306 686.4209 694.2207 718.7808 761.0106 761.3981 797.1386 826.0164 851.1698 853.1077 882.6316 920.7989 982.4571 997.5621 1008.0663 1021.5781 1088.3890 1117.4954 1128.9707 1151.5871 1184.0365 1198.1980 1255.7122 1285.9308 1310.9149 1323.8252 1370.7205 1383.2903 1417.9219 1426.3938 1462.6418 1470.4070 1501.0510 1529.0413 1586.2814 1622.7841 1644.3701 1663.2994 3008.2108 3094.2865 3127.2125 3150.5065 3158.8098 3181.6971 3197.5991 3424.1348 3535.5199
redmass: 8.6527 5.1101 5.6078 7.7690 4.4648 1.4085 2.9129 9.8306 6.7850 7.0105 6.8614 5.3837 3.5672 7.3105 6.1510 2.9439 6.5244 10.1863 7.0553 2.7476 5.1012 1.2290 7.1739 3.8440 6.1909 5.4121 5.5482 3.8472 1.2700 5.8819 6.3459 1.3242 1.5585 3.1472 1.3727 4.7419 1.3417 2.8309 4.1501 1.3270 1.3417 1.6542 2.4984 1.1773 2.3158 3.9192 1.4278 2.7552 8.2557 5.6431 1.2262 4.1011 1.0425 1.0747 2.2937 2.6089 4.9045 5.8291 8.1648 8.8405 1.0336 1.1011 1.0909 1.1011 1.0911 1.0947 1.0951 1.0765 1.0642
irintensity: 0.6809 0.8749 0.0453 0.9568 7.4806 3.1284 2.4754 2.6564 0.6410 5.1337 19.5165 1.1743 7.0754 28.4073 1.3940 0.4658 19.5323 4.0076 3.5959 54.5924 23.9228 74.2239 0.7692 76.2219 4.0812 40.6884 49.1790 5.7188 47.1345 17.0066 74.3304 53.0621 72.2554 322.0183 0.0058 169.2139 0.1918 176.9963 123.7461 0.4685 4.7214 176.8439 17.2786 5.3447 37.4672 11.6686 1.4487 167.4169 251.8996 100.0401 51.8039 62.4257 23.2672 19.3555 38.0544 634.7017 205.2599 177.9956 213.6467 229.2037 12.8752 11.0995 10.9973 0.3961 0.9861 1.0842 1.8798 91.7541 55.2611
temp: 298.150 k
press: 1.00000 atm
elementType: 8 8 8 8 7 7 7 6 6 6 6 6 6 6 6 6 1 1 1 1 1 1 1 1 1
symmnumber: 1
zpe: 471028.2 jmol-1
zpe.correction: 0.179405 hartree
zpe.thermalcorrener: 0.194229 hartree
zpe.thermalcorrenthalpy: 0.195173 hartree
zpe.thermalcorrgfe: 0.136273 hartree
zpe.sumelectzpe: -812.320174 hartree
zpe.sumelectthermal: -812.305350 hartree
zpe.sumelectthermalent: -812.304406 hartree
zpe.sumelectthermalfe: -812.363306 hartree
dipole: -1.3732 -1.4111 0.0014
dipole: 1.9690
quadrupole: -91.5042 -96.7896 -92.9133
quadrupole: -18.8434 -0.0072 -0.0003
quadrupole: 2.2315 -3.0539 0.8224 -18.8434 -0.0072 -0.0003
hfenergy: -812.499579 hartree
pointgroup: C01 [X(C9H9N3O4)]
dipole: 0.5502757 -0.5452459 -0.0005375 debye
dipolederiv: -0.7134446 0.1221473 -0.0000268 -0.4491072 -0.9771848 -0.0000198 -0.0000502 -0.0000332 -0.344519 -0.8642838 -0.4672989 -0.0000022 -0.7381734 -0.9504789 0.0000611 0.0003119 0.0003732 -0.4305802 -1.1494725 0.2839724 -0.0000028 0.3556389 -0.8159532 0.0001537 0.0004528 -0.0003013 -0.3343432 -1.1258582 0.7435268 -0.000286 0.254402 -0.4800304 -0.0000642 -0.0008947 0.000676 -0.1780434 -2.2345359 -0.2423747 -0.0000589 -0.7074783 -0.4688681 -0.0000452 -0.000056 -0.0000383 -0.2905286 -1.0852394 0.3004434 -0.0003252 1.0779188 -0.872673 0.0002748 0.0004204 -0.0003037 -0.1206604 0.5309005 -0.7497153 0.0005241 -1.0672207 1.0001939 -0.000228 0.0008443 -0.0004551 -0.050011 1.6401345 0.0881483 0.0000294 -0.1212051 0.1453652 -0.0000053 -0.0000068 0.0000082 0.1183991 -0.4931916 0.082629 0.000007 0.3221339 -0.0796679 0.0000179 0.0000996 0.000008 -0.1656011 -0.5165426 -0.1160785 -0.0000167 -0.3287177 0.0014943 0.0000271 -0.0000729 0.0000115 -0.201324 -1.1042004 -0.0267043 0.0000964 0.0125283 -0.1148234 -0.0000152 0.0000418 0.0000103 -0.0117887 0.338708 -0.0626624 -0.0000017 0.1370195 0.0874188 0.000004 -0.0001269 0.000024 -0.0989553 0.3541924 0.0554754 0.0000044 -0.1396362 0.0572526 0.0000233 -0.0001546 0.0000153 -0.0954908 2.6363509 -0.246624 0.0001388 0.8292066 1.3332809 0.0001176 0.0000318 0.0000299 0.3107826 2.4527511 0.0924835 -0.0002134 0.1838234 1.3749171 -0.0001831 -0.0006546 -0.000069 0.2351636 0.1830338 0.0131399 -0.0000139 0.1891193 0.0576249 -0.0000705 -0.0002854 0.0000895 0.2016809 0.1395847 -0.0532887 0.0000037 -0.0353601 0.0639216 -0.0000182 0.0000194 -0.0000162 0.1783516 0.0071018 0.1033147 0.0000206 0.0963513 -0.025078 -0.0000212 0.0000409 -0.0000106 0.1667199 0.0848447 0.0599743 0.0000023 0.0404883 0.019351 -0.0000108 -0.0000088 -0.0000161 0.1524613 0.0916793 -0.0549592 -0.0000145 -0.0575786 0.0191038 -0.0000172 -0.0000168 -0.0000163 0.1587181 0.3975671 -0.0277397 -0.0000021 -0.1094908 0.1670597 -0.0000032 -0.0001204 0.0000192 0.2970463 0.0112254 -0.0316884 0.0598491 0.029212 0.0712634 -0.0671932 0.0773038 -0.0087873 -0.0215356 0.0112025 -0.0316837 -0.0598408 0.0292084 0.0713109 0.067263 -0.0772776 0.0087905 -0.0214448 0.1960289 0.0802615 0.0000344 0.013089 0.027835 -0.0000235 0.0000568 0.0000088 0.1442848 0.2114631 0.0853011 0.000095 0.1838284 0.2873648 -0.0000241 0.0001024 -0.0000173 0.4012178 unknown
polarizability: 258.8746287|-4.3135559|140.3796602|0.0045006|-0.0008366|56.8429212 unknown
InChI: InChI=1S/C9H9N3O4/c1-12(11-16)9(15)10-7-4-2-6(3-5-7)8(13)14/h2-5,10,13H,1H3
charge 0 multiplicity 1
25 atoms
O  2.081506 1.965544 -0.000047
O  -4.996131 -1.251772 0.000299
O  -5.049743 1.071201 0.000413
O  5.025741 -1.567775 0.000912
N  1.346625 -0.287609 -0.000296
N  3.652667 0.213335 -0.000232
N  3.811026 -1.174785 -0.000396
C  -0.06496 -0.161177 -0.000284
C  -0.735743 1.093127 -0.000141
C  -0.817574 -1.369397 -0.000418
C  -2.896602 -0.081941 -0.000286
C  -2.141016 1.11886 -0.000132
C  -2.220314 -1.330093 -0.000407
C  2.286161 0.724764 -0.000187
C  -4.375995 0.011773 -0.000304
C  4.804272 1.130133 -0.000119
H  -0.157642 2.018587 -0.000042
H  -0.298026 -2.335327 -0.000529
H  -2.677007 2.073569 -0.000032
H  -2.802617 -2.255151 -0.000516
H  1.745211 -1.236727 -0.000388
H  5.425913 0.951623 -0.894124
H  5.425999 0.951275 0.893755
H  4.411338 2.156139 0.000095
H  -5.981588 -1.119576 0.000807
