program: Gaussian 09
title: 000009135
version: EM64L-G09RevD.01
frameworkgroup: C1[X(C22H14)]
method: RPBEPBE
basis: SDD
operation: Freq
keyword: #p
keyword: freq=noraman
keyword: PBEPBE/SDD
title: #p freq=noraman PBEPBE/SDD
converged: NO YES NO NO
title: Mulliken charges:
elementType: C C C C C C C C C C C C C C C C C C C C C C H H H H H H H H H H H H H H
charge: 0.078058 0.235770 0.241170 0.450211 0.196507 0.153490 0.394064 0.418507 -0.435604 -0.444421 -0.505925 -0.471077 -0.513453 -0.487948 -0.403536 -0.351532 -0.444191 -0.439554 -0.261441 -0.260759 -0.252815 -0.249881 0.225548 0.279323 0.238567 0.241293 0.235339 0.238182 0.277837 0.221121 0.240155 0.240765 0.229179 0.227267 0.230351 0.229435
chargesum: 0.00000
title: Mulliken charges with hydrogens summed into heavy atoms:
elementType: C C C C C C C C C C C C C C C C C C C C C C
charge: 0.078058 0.235770 0.241170 0.450211 0.196507 0.153490 0.394064 0.418507 -0.210056 -0.165099 -0.267358 -0.229784 -0.278114 -0.249765 -0.125699 -0.130411 -0.204036 -0.198790 -0.032262 -0.033492 -0.022465 -0.020446
polarizability: 4.45981914e+02 3.70791818e+00 2.67196047e+02 9.73781830e+00 2.09902336e+00 9.65856123e+01
1716.lowfreq: -4.6424 -3.7336 -0.0005 -0.0004 0.0004 3.3883 45.9174 70.9136 97.3074
frequency: 45.9105 70.9006 97.3073 114.9190 153.7032 196.0277 224.1201 244.3447 262.1995 306.4437 308.7301 399.6752 407.5300 416.6079 430.5979 464.6407 487.0746 496.7616 514.1329 524.8618 538.9611 557.0680 571.2162 577.6053 597.5051 649.4525 656.6545 671.6493 716.8723 731.3962 756.6538 759.2160 774.3204 781.1754 788.0247 801.3343 825.3659 843.2890 856.5302 857.1773 870.8629 882.2646 892.9789 953.4924 957.1671 967.9107 978.5642 986.8645 987.8041 990.3357 993.1679 1011.5278 1037.6087 1046.9919 1083.7349 1125.9119 1153.1408 1164.0503 1172.0802 1176.7489 1184.7750 1225.6480 1229.5212 1240.1837 1245.0101 1249.2438 1272.3766 1291.6765 1329.4539 1357.3199 1388.7007 1395.4662 1404.4995 1415.7974 1418.8713 1425.3275 1442.7674 1447.8836 1487.6184 1498.0887 1522.7575 1535.4855 1568.1011 1599.1958 1609.7070 1613.4513 1624.7415 1630.2598 3119.7033 3121.0706 3121.4351 3124.6942 3126.1313 3133.1310 3133.9656 3145.4310 3149.1824 3156.6180 3161.9049 3168.3198 3169.8008 3180.7468
redmass: 4.9977 4.3390 4.8171 3.9297 4.9186 4.3829 5.0185 4.0842 4.5236 5.2530 4.8528 4.5614 3.5523 4.8240 3.5022 3.3276 6.0049 4.3179 5.8336 3.0402 4.2139 6.5560 4.7229 4.2260 3.4298 6.1292 3.4326 5.8631 5.7717 3.0262 1.4606 1.2809 1.8567 5.2090 5.1481 2.1250 1.8285 1.9747 3.3284 1.9485 4.3048 1.6950 1.6614 1.3666 1.3754 1.4053 1.3912 1.5184 5.8797 1.3732 3.0079 1.3682 2.2097 2.1667 2.7659 1.8357 1.3859 1.2691 1.1670 1.0840 1.2193 1.8723 2.2184 2.1409 1.7412 1.6261 1.6883 1.7954 2.6779 4.1192 4.0411 3.8912 4.3042 2.9609 2.3947 3.2232 2.5481 2.3258 3.0660 3.5833 4.1894 4.2468 7.9358 6.7070 6.1316 6.2679 6.5962 6.6608 1.0865 1.0868 1.0864 1.0890 1.0882 1.0886 1.0896 1.0987 1.0947 1.0962 1.0984 1.0953 1.0963 1.0936
irintensity: 0.3143 0.0294 0.2239 0.6453 1.1597 1.9650 0.9452 2.9238 1.7725 1.0190 1.3323 0.9798 4.6877 3.8105 5.6089 5.3734 0.1690 6.6534 2.3281 0.1796 1.4904 0.5409 5.7393 3.0172 0.6810 7.4009 3.2144 3.2600 4.3276 21.4977 37.4906 75.0526 6.3359 4.3153 7.4098 19.4934 7.5695 22.5603 14.7380 52.4072 2.7027 3.0388 35.4572 4.6571 1.5136 0.8233 1.2007 1.4967 0.3013 0.3910 1.5722 0.9095 10.9023 3.4919 2.8795 2.9871 1.0939 3.4362 1.3427 4.3762 0.9070 0.4679 2.6389 2.5012 0.2150 26.0468 7.1305 0.3123 2.4296 2.6439 3.1257 0.8803 0.2362 1.0925 0.4723 3.8544 3.0147 13.9691 5.9215 9.8165 7.1719 0.7274 0.1902 1.9594 0.9020 2.4598 0.3365 0.7572 1.2857 1.1457 3.7961 11.8258 3.5755 12.0149 11.8240 41.2152 16.5354 45.5164 24.1275 42.2259 7.1155 13.9711
temp: 298.150 k
press: 1.00000 atm
elementType: 6 6 6 6 6 6 6 6 6 6 6 6 6 6 6 6 6 6 6 6 6 6 1 1 1 1 1 1 1 1 1 1 1 1 1 1
symmnumber: 1
zpe: 745137.3 jmol-1
zpe.correction: 0.283808 hartree
zpe.thermalcorrener: 0.298767 hartree
zpe.thermalcorrenthalpy: 0.299711 hartree
zpe.thermalcorrgfe: 0.242100 hartree
zpe.sumelectzpe: -845.346526 hartree
zpe.sumelectthermal: -845.331566 hartree
zpe.sumelectthermalent: -845.330622 hartree
zpe.sumelectthermalfe: -845.388234 hartree
dipole: -0.0417 0.0631 0.0454
dipole: 0.0882
quadrupole: -106.4835 -108.4926 -135.3173
quadrupole: -0.1035 1.7291 0.9617
quadrupole: 10.2809 8.2719 -18.5528 -0.1035 1.7291 0.9617
hfenergy: -845.6303334 hartree
pointgroup: C01 [X(C22H14)]
dipole: 0.0163616 -0.0248332 0.0178483 debye
polarizability: 445.9428216|3.0652099|267.1649528|-10.8140203|-2.3666573|96.6557987 unknown
InChI: InChI=1S/C22H14/c1-3-7-18-15(5-1)11-14-21-20(18)13-12-17-10-9-16-6-2-4-8-19(16)22(17)21/h1-14H
charge 0 multiplicity 1
36 atoms
C  1.079942 -0.46148 -0.04626
C  -0.274798 0.076599 -0.13618
C  -1.410237 -0.790052 0.067799
C  1.236391 -1.88991 -0.066591
C  2.295794 0.353666 0.065269
C  -2.765645 -0.236748 0.081159
C  3.585938 -0.272507 -0.150336
C  -2.964643 1.157219 -0.233642
C  -1.187773 -2.203459 0.191845
C  -0.53879 1.443451 -0.535536
C  0.085334 -2.736314 0.061531
C  2.540689 -2.485343 -0.227503
C  -1.822318 1.957001 -0.590997
C  3.671771 -1.700649 -0.334717
C  2.306113 1.726821 0.481029
C  -3.921758 -1.020344 0.394825
C  4.780735 0.511828 -0.102398
C  -4.282903 1.710387 -0.230317
C  3.492997 2.468476 0.554778
C  -5.204909 -0.458256 0.400056
C  4.742235 1.871435 0.222187
C  -5.39253 0.919095 0.082833
H  -2.035509 -2.879851 0.32985
H  0.291974 2.063475 -0.878035
H  0.235449 -3.822248 0.070896
H  2.607358 -3.578095 -0.283947
H  -1.987653 2.986918 -0.929202
H  4.657287 -2.15047 -0.502472
H  1.377297 2.197083 0.811603
H  -3.814791 -2.078067 0.65345
H  5.739185 0.014812 -0.295552
H  -4.408607 2.77142 -0.477392
H  3.458507 3.51065 0.891328
H  -6.070229 -1.08069 0.653552
H  5.664198 2.461349 0.261839
H  -6.399501 1.350102 0.087048
