program: Gaussian 09
title: 000101462
version: EM64L-G09RevD.01
frameworkgroup: C1[X(C20H27ClO3)]
method: RPBEPBE
basis: SDD
operation: Freq
keyword: #p
keyword: freq=noraman
keyword: PBEPBE/SDD
title: #p freq=noraman PBEPBE/SDD
converged: NO YES NO NO
title: Mulliken charges:
elementType: Cl O O O C C C C C C C C C C C C C C C C C C C C H H H H H H H H H H H H H H H H H H H H H H H H H H H
charge: -0.031222 -0.273931 -0.194639 -0.244415 -0.123340 0.371470 -0.144915 -0.071544 -0.530785 -0.103474 -0.550491 -0.523415 -0.238967 -0.459156 -0.483152 -0.816846 -0.628123 0.634184 -0.468274 -0.542498 -0.568937 0.218233 0.275729 -0.761956 0.219299 0.235108 0.229485 0.203299 0.221120 0.261194 0.216518 0.228227 0.212345 0.226692 0.238446 0.223437 0.240403 0.228131 0.225099 0.229209 0.244590 0.215186 0.225143 0.260900 0.221841 0.231416 0.250661 0.232794 0.246529 0.246382 0.247007
chargesum: 0.00000
title: Mulliken charges with hydrogens summed into heavy atoms:
elementType: Cl O O O C C C C C C C C C C C C C C C C C C C C
charge: -0.031222 -0.273931 -0.194639 -0.244415 0.095959 0.371470 0.090193 0.157941 -0.106365 0.157719 -0.105746 -0.084378 -0.000521 0.004684 -0.029923 -0.127860 -0.142080 0.634184 -0.015017 -0.059043 -0.568937 0.218233 0.275729 -0.022037
chargesum: 0.00001
polarizability: 3.13921144e+02 7.97676990e-01 2.12264024e+02 -1.14211381e+01 -2.80105785e+00 1.65116119e+02
1716.lowfreq: -11.8756 -4.1461 -0.1131 -0.0729 -0.0171 3.8680 21.8007 29.0911 40.0111
frequency: 21.7613 28.9675 40.0041 46.6054 58.2719 67.7380 82.3730 99.3387 133.8388 157.0092 158.5589 183.5133 187.9547 211.0728 213.3459 239.0497 244.6244 252.4967 269.5067 283.5128 291.9134 322.3104 341.2164 360.9448 385.1701 397.6689 421.2504 437.8425 455.9830 471.3519 478.8953 505.0349 533.7177 535.4093 540.6533 554.6891 569.9196 579.5793 628.3588 654.3569 681.7277 696.3475 734.0950 791.0534 809.3509 818.4225 830.7710 836.2206 856.6455 870.5348 893.9271 909.1613 923.5236 949.9381 960.7297 972.9786 976.0082 994.7627 998.7263 1011.1685 1016.6929 1021.2671 1027.3876 1040.7693 1041.0510 1053.8918 1072.7979 1082.7601 1088.2508 1090.6524 1113.9554 1123.1777 1129.2612 1143.9457 1162.6738 1171.5630 1181.1439 1193.6774 1202.3275 1206.5973 1215.4861 1226.9152 1228.2643 1244.4559 1246.9712 1257.0810 1274.7892 1278.2037 1284.1195 1288.8557 1291.2606 1300.6747 1304.8291 1319.0390 1322.0769 1326.4797 1332.7541 1333.8282 1343.3691 1347.5865 1353.7366 1356.9186 1373.5694 1382.1474 1391.1690 1442.4229 1453.1146 1454.2637 1456.2208 1461.0372 1467.5716 1468.0484 1469.0482 1474.5059 1480.1476 1490.0207 1494.3781 1590.0965 1602.3877 1647.3240 2902.9505 2909.7650 2928.9819 2945.4035 2950.3657 2962.2766 2973.3619 2973.9731 2976.9820 2983.2555 2993.7581 2998.9133 3006.8696 3008.6869 3020.4011 3028.8315 3041.1347 3042.4178 3055.9789 3056.5360 3070.8413 3075.2576 3086.7163 3090.9981 3094.8225 3095.1292 3142.7769
redmass: 7.1944 7.5122 2.1594 1.9702 4.3165 2.6638 3.7225 2.8626 3.2705 3.2496 2.7166 3.0343 2.4443 2.3136 1.8528 4.2846 3.5579 3.0767 2.8375 2.8911 5.4739 3.4004 3.1235 2.4995 3.7504 2.9199 3.6768 3.4664 3.5023 3.0377 3.4455 3.0733 2.9320 3.7120 3.4916 3.0159 3.1216 3.0048 3.7413 3.0927 4.3480 3.6953 2.3017 2.4633 2.1798 2.3896 2.0049 1.9143 2.0150 3.2303 2.8873 2.3216 2.0312 1.9716 2.5209 2.4819 2.2818 2.0435 2.2295 2.1782 2.2694 2.5549 1.9729 1.7779 2.2492 2.3527 2.0039 2.9747 2.0017 2.0490 1.6827 1.6002 1.9213 1.6665 1.9851 1.8581 1.7637 1.8560 2.3552 1.7505 1.4327 1.5549 1.7011 1.4614 1.3433 1.5067 1.4242 1.6160 1.4325 1.5415 1.4738 1.7345 1.3571 1.4804 1.3828 1.3294 1.4402 1.3487 1.4384 1.4327 1.4067 1.4882 1.5179 1.2514 1.2220 1.0820 1.0637 1.0848 1.0474 1.0738 1.0794 1.0864 1.0868 1.0772 1.0802 1.0778 1.0605 9.3413 11.3014 9.3117 1.0792 1.0805 1.0814 1.0695 1.0828 1.0628 1.0659 1.0653 1.0626 1.0621 1.0608 1.0378 1.0381 1.0840 1.0632 1.0964 1.0994 1.0997 1.1010 1.0976 1.0954 1.0906 1.0994 1.1011 1.0974 1.0984 1.1009
irintensity: 2.2627 1.1431 0.9268 1.4500 2.3159 0.2009 1.4746 0.2618 2.1763 3.0503 0.4148 2.6575 0.0481 0.3069 0.6960 0.3464 6.4935 0.3235 0.9706 0.9472 2.5731 1.3798 0.3236 0.6771 1.8177 0.0357 0.9285 0.2757 3.4749 0.1798 0.1982 4.6479 4.4256 3.6243 11.3488 9.7664 3.4586 5.7072 2.1617 5.4785 2.7241 5.6004 0.7239 28.4359 0.8959 0.6567 21.0822 12.3086 3.0763 28.6882 11.6116 2.4712 3.8122 31.0716 3.8574 13.9640 29.9859 5.0764 146.9433 36.1362 3.5576 24.1549 6.2642 9.5280 1.1392 23.8092 4.4570 5.9454 4.4635 7.3745 22.6205 3.5078 4.9504 5.1989 1.6785 4.5416 21.2195 6.4289 296.2729 33.2443 112.0411 3.9829 5.9241 9.5942 5.3611 12.7447 1.6955 4.5783 1.2556 6.3393 0.7120 11.2427 0.6890 2.1936 3.3255 4.2879 0.0037 0.0828 3.3137 1.3529 0.6422 0.5501 1.7518 50.9499 33.6109 14.2657 24.7967 16.6742 19.1210 2.4047 7.4864 8.8894 8.6066 9.6236 2.2670 12.6505 5.2941 153.4063 154.6179 187.5661 9.7482 7.8183 3.9515 7.5097 31.2552 35.6880 24.7187 1.1599 52.3854 34.0650 27.3024 27.7864 2.2266 9.6803 32.2292 35.4621 4.1748 92.5167 18.7141 28.0218 16.8766 9.1109 39.2478 17.7079 8.1886 37.7980 12.4416
temp: 298.150 k
press: 1.00000 atm
elementType: 17 8 8 8 6 6 6 6 6 6 6 6 6 6 6 6 6 6 6 6 6 6 6 6 1 1 1 1 1 1 1 1 1 1 1 1 1 1 1 1 1 1 1 1 1 1 1 1 1 1 1
symmnumber: 1
zpe: 1128188.0 jmol-1
zpe.correction: 0.429704 hartree
zpe.thermalcorrener: 0.452925 hartree
zpe.thermalcorrenthalpy: 0.453869 hartree
zpe.thermalcorrgfe: 0.376057 hartree
zpe.sumelectzpe: -1462.239306 hartree
zpe.sumelectthermal: -1462.216085 hartree
zpe.sumelectthermalent: -1462.215141 hartree
zpe.sumelectthermalfe: -1462.292954 hartree
dipole: -5.2211 -1.3448 3.6409
dipole: 6.5057
quadrupole: -203.1026 -143.7792 -153.6399
quadrupole: 5.2196 -1.5434 0.9484
quadrupole: -36.2620 23.0614 13.2007 5.2196 -1.5434 0.9484
hfenergy: -1462.6690101 hartree
pointgroup: C01 [X(C20H27Cl1O3)]
dipole: 2.0208201 0.6390949 1.4349511 debye
polarizability: 313.5225203|5.6123739|212.6224528|11.8996314|2.8457412|165.1563139 unknown
InChI: InChI=1S/C20H27ClO3/c1-11(22)24-18-8-6-16-14-3-4-15-12(5-7-17(23)19(15)21)13(14)9-10-20(16,18)2/h12-14,16,18H,3-10H2,1-2H3
charge 0 multiplicity 1
51 atoms
Cl -5.481981 -1.983545 -0.471602
O  4.583632 0.584863 0.173633
O  -6.414611 0.849827 -0.800401
O  5.838902 -0.059237 -1.687007
C  1.203239 -0.944112 -0.082674
C  2.103717 0.271535 0.312321
C  -0.22899 -0.822405 0.466527
C  -0.878704 0.481882 -0.094315
C  1.485866 1.549498 -0.298187
C  3.426592 -0.204845 -0.337359
C  2.06243 -2.188851 0.273635
C  0.010268 1.736087 0.149307
C  -2.32925 0.696932 0.464671
C  3.536204 -1.721171 0.008379
C  -1.106955 -2.037553 0.105371
C  2.290816 0.427973 1.845021
C  -2.538601 -1.878616 0.667557
C  -3.18731 -0.564837 0.279387
C  -2.987679 1.953534 -0.15686
C  -4.495303 2.04058 0.137569
C  -4.484736 -0.47422 -0.159933
C  -5.239946 0.795958 -0.344516
C  5.74359 0.573052 -0.610608
C  6.822086 1.419454 0.031785
H  1.116799 -0.918865 -1.19446
H  -0.187903 -0.752068 1.576087
H  -0.971428 0.341678 -1.195991
H  1.522528 1.475742 -1.405458
H  2.073742 2.444333 -0.015479
H  3.393985 -0.065287 -1.435371
H  1.79179 -3.067019 -0.338094
H  1.922286 -2.474686 1.333323
H  -0.025791 2.001011 1.226018
H  -0.407599 2.601889 -0.396532
H  -2.228589 0.855866 1.564754
H  4.165637 -1.847089 0.907952
H  4.019013 -2.276625 -0.812083
H  -0.66425 -2.967082 0.510185
H  -1.148792 -2.151403 -0.997065
H  2.670037 -0.496585 2.314504
H  3.024954 1.226402 2.047909
H  1.347024 0.69554 2.349264
H  -2.477922 -1.901281 1.778186
H  -3.175814 -2.725994 0.36752
H  -2.831388 1.93176 -1.254418
H  -2.491253 2.86408 0.222065
H  -4.958508 2.921988 -0.338398
H  -4.665475 2.131245 1.230782
H  7.060434 1.031102 1.037221
H  6.468274 2.457494 0.156794
H  7.725333 1.407468 -0.594716
