program: Gaussian 09
title: 000101386
version: EM64L-G09RevD.01
frameworkgroup: C1[X(C14H10O3)]
method: RPBEPBE
basis: SDD
operation: Freq
keyword: #pfreq=noraman
keyword: PBEPBE/SDD
title: #p freq=noraman PBEPBE/SDD
converged: YES YES NO NO
title: Mulliken charges:
elementType: O O O C C C C C C C C C C C C C C H H H H H H H H H H
charge: -0.222862 -0.439231 -0.245866 0.319137 0.295194 0.008241 -0.485267 0.244878 -0.358416 -0.324103 -0.216241 -0.358551 -0.355266 -0.235216 -0.231200 -0.227030 0.099846 0.308553 0.278426 0.280575 0.239161 0.263008 0.272096 0.234079 0.234189 0.234642 0.387224
chargesum: 0.00000
title: Mulliken charges with hydrogens summed into heavy atoms:
elementType: O O O C C C C C C C C C C C C C C
charge: -0.222862 -0.052007 -0.245866 0.319137 0.295194 0.008241 -0.176714 0.244878 -0.079990 -0.043527 0.022919 -0.095543 -0.083170 -0.001137 0.002988 0.007611 0.099846
polarizability: 2.22203892e+02 -1.28860970e+01 1.76982517e+02 -1.74349660e+01 -4.94564331e+00 8.57596910e+01
1716.lowfreq: -0.0004 0.0006 0.0010 1.9398 2.7057 9.1757 39.0359 50.6571 56.0595
frequency: 39.0027 50.6491 56.0590 74.8053 127.8606 151.3511 174.0221 217.9449 246.1781 290.6158 333.6332 385.3045 404.2188 421.7232 430.7146 448.8544 494.7458 562.7192 594.0057 602.4478 614.5983 639.3205 674.9690 691.9053 702.2587 714.2538 740.3471 795.8425 806.1788 840.5881 862.4546 929.0909 948.9358 963.6520 970.6439 988.7272 989.6183 993.1945 1006.3530 1010.0333 1027.0753 1039.0360 1085.9445 1094.3411 1127.2112 1168.4809 1175.4623 1183.4618 1190.4908 1269.4218 1305.6280 1318.1626 1327.8668 1384.6810 1392.1760 1424.4482 1434.3819 1467.2925 1479.1490 1538.5923 1583.1207 1591.6048 1606.8717 1609.1745 1645.2709 3130.6402 3140.0376 3145.1229 3150.7071 3158.9978 3161.3207 3163.7331 3170.8092 3181.0381 3531.1582
redmass: 7.2982 4.8425 6.6349 5.8809 6.4273 6.2652 4.6303 4.9769 5.6972 5.5987 9.1846 6.1958 2.8526 3.3510 4.4663 4.6151 5.7224 3.6656 4.7367 1.4786 6.4421 5.9790 3.9254 5.7600 1.9172 1.8627 3.1644 3.0487 4.4188 1.7343 1.2501 3.6911 1.6006 1.4785 1.4358 5.8727 4.0547 1.5646 1.3370 1.3806 2.2296 2.9010 1.5781 1.6856 1.7100 2.1139 1.0633 1.1546 1.1424 2.2403 1.6190 1.3754 2.7192 8.5034 10.0086 3.5264 2.3012 2.4440 2.3104 9.4297 6.0524 6.7293 6.1768 6.1125 8.7198 1.0851 1.0881 1.0875 1.0925 1.0941 1.0942 1.0940 1.1014 1.0974 1.0642
irintensity: 4.4695 0.7199 0.4453 0.4276 0.8791 1.0454 2.3124 0.7634 4.1180 0.9176 1.1420 11.4114 0.5373 2.7597 4.1370 6.0579 9.4800 20.9835 59.3077 83.2176 0.4263 48.2791 19.6024 2.0840 45.9327 125.5277 17.6383 11.0091 23.9676 24.0112 3.0270 12.6384 6.7981 2.4890 9.2304 1.2887 1.9150 2.3755 0.3495 4.5473 24.7720 296.2407 7.2989 17.9558 118.1879 66.3577 0.2988 0.1980 7.3386 242.2584 71.8106 15.4249 48.9337 2.1891 7.9573 26.2485 12.8886 5.6047 3.3074 144.5199 4.3902 6.1680 53.7152 15.6281 225.8158 0.3380 4.3159 5.5064 17.9800 11.8460 8.3873 7.5474 19.4955 6.4772 50.5267
temp: 298.150 k
press: 1.00000 atm
elementType: 8 8 8 6 6 6 6 6 6 6 6 6 6 6 6 6 6 1 1 1 1 1 1 1 1 1 1
symmnumber: 1
zpe: 528705.9 jmol-1
zpe.correction: 0.201373 hartree
zpe.thermalcorrener: 0.215273 hartree
zpe.thermalcorrenthalpy: 0.216218 hartree
zpe.thermalcorrgfe: 0.159260 hartree
zpe.sumelectzpe: -764.005324 hartree
zpe.sumelectthermal: -763.991424 hartree
zpe.sumelectthermalent: -763.990479 hartree
zpe.sumelectthermalfe: -764.047437 hartree
dipole: -1.1985 -1.4178 1.4839
dipole: 2.3767
quadrupole: -76.9633 -100.1801 -98.0500
quadrupole: -8.3874 -2.5266 -0.4917
quadrupole: 14.7679 -8.4490 -6.3189 -8.3874 -2.5266 -0.4917
hfenergy: -764.206697 hartree
pointgroup: C01[X(C14H10O3)]
dipole: 0.4579146 -0.5231397 -0.6252846 debye
polarizability: 219.0750974|15.297095|177.5655393|-24.1955202|6.3624254|88.3054637 unknown
InChI: InChI=1S/C14H10O3/c15-13(10-5-2-1-3-6-10)11-7-4-8-12(9-11)14(16)17/h1-9,16H
charge 0 multiplicity 1
27 atoms
O  -1.577792 2.528127 0.575538
O  4.407801 -1.385688 -0.269279
O  2.452448 -2.491933 0.318054
C  0.303032 1.216839 -0.132371
C  -2.125084 0.255902 0.006253
C  -1.162585 1.395686 0.17239
C  0.974592 -0.019019 0.023289
C  2.370063 -0.106914 -0.210656
C  1.049007 2.367041 -0.51188
C  3.100971 1.040686 -0.610307
C  2.433507 2.276436 -0.758532
C  -1.92941 -0.787591 -0.939184
C  -3.315828 0.27283 0.78376
C  -2.901627 -1.799718 -1.092393
C  -4.276811 -0.746261 0.640643
C  -4.071245 -1.78711 -0.298076
C  3.0263 -1.429063 -0.021417
H  0.444761 -0.917189 0.355973
H  0.519091 3.321593 -0.596799
H  4.175759 0.953584 -0.791681
H  2.994404 3.166597 -1.061143
H  -1.03842 -0.793545 -1.575515
H  -3.464019 1.097967 1.488235
H  -2.747805 -2.594608 -1.830032
H  -5.184828 -0.732181 1.253102
H  -4.820341 -2.578529 -0.412824
H  4.786657 -2.294237 -0.126648
