program: Gaussian 09
title: 000101373
version: EM64L-G09RevD.01
frameworkgroup: C1[X(C8H15NO3)]
method: RPBEPBE
basis: SDD
operation: Freq
keyword: #p
keyword: freq=noraman
keyword: PBEPBE/SDD
title: #p freq=noraman PBEPBE/SDD
converged: YES YES NO NO
title: Mulliken charges:
elementType: O O O N C C C C C C C C H H H H H H H H H H H H H H H
charge: -0.246017 -0.266875 -0.242661 -0.091812 -0.331322 -0.346731 -0.338829 -0.324119 -0.318002 -0.508854 0.238611 -0.504875 0.190565 0.209456 0.215252 0.192854 0.189354 0.244211 0.191930 0.214803 0.214770 0.193352 0.257313 0.249438 0.234089 0.242388 0.241710
chargesum: 0.00000
title: Mulliken charges with hydrogens summed into heavy atoms:
elementType: O O O N C C C C C C C C
charge: -0.246017 -0.266875 -0.242661 -0.091812 0.068699 0.061375 0.094736 0.082614 0.090120 -0.002103 0.238611 0.213312
polarizability: 1.28881003e+02 -3.69600181e+00 9.98646347e+01 1.69430685e+00 4.71316412e-01 7.69408328e+01
1716.lowfreq: -0.0010 -0.0010 -0.0003 6.0138 10.3828 17.4497 32.0622 41.9409 74.6281
frequency: 29.6279 41.0850 74.6162 80.5685 88.3367 155.3014 194.4531 207.1150 238.4136 253.3396 311.0953 323.6182 397.8391 448.5526 451.2850 473.9302 573.3618 595.3754 667.7937 757.6579 793.7579 807.3752 839.9809 850.5810 899.7137 956.8685 1000.7069 1028.4546 1044.1455 1055.2293 1063.6118 1090.5427 1107.3806 1112.7655 1129.6434 1135.9628 1147.5211 1162.3666 1191.4451 1199.3965 1242.3619 1268.4749 1290.2495 1297.1240 1311.2358 1332.8036 1346.7876 1367.9645 1373.2765 1394.5493 1422.0354 1443.4679 1444.5179 1451.3190 1452.5216 1452.8508 1461.0896 1464.2688 1479.7558 1645.0517 2857.5857 2860.1185 2875.2408 2954.7990 2958.6281 2997.1793 3004.7952 3027.7846 3036.2013 3044.0668 3077.9380 3080.2229 3083.5455 3106.3305 3149.8199
redmass: 4.5646 3.5345 4.1486 2.7909 1.0902 3.0347 3.3147 4.3445 2.0310 3.2084 2.7332 3.2947 1.8901 3.7783 4.9632 2.8904 3.1551 2.0609 3.9154 3.5878 1.3930 4.0294 1.8214 3.6595 2.4710 5.4409 2.7739 2.1935 2.0781 1.9797 3.0176 3.8105 2.0970 1.2866 2.9169 2.3347 1.4424 3.2820 1.0833 1.3337 1.2456 1.2766 1.2300 1.3477 1.4588 1.2981 1.2841 1.4239 1.2792 1.4666 1.1940 1.0807 1.0815 1.0864 1.0502 1.0928 1.0948 1.0507 1.0920 8.8539 1.0713 1.0701 1.0689 1.0664 1.0665 1.0632 1.0298 1.0898 1.0894 1.0879 1.0958 1.0962 1.0980 1.1045 1.1048
irintensity: 1.1915 0.6114 0.3044 0.5826 0.1888 6.5009 6.6594 3.8948 6.1173 7.4409 14.7507 17.2154 0.4493 2.1054 6.5067 0.5718 5.4575 2.2695 7.9923 5.7258 8.8241 17.3412 2.9016 10.8994 11.1542 22.2309 55.0902 10.1332 8.3038 23.7038 6.9405 85.1422 1.9109 3.5536 199.4435 17.6336 3.8858 83.3428 1.3762 1.0959 43.2752 6.1473 17.8704 12.6400 34.7925 14.6459 23.9002 7.0299 5.7725 18.8372 26.0133 12.6690 2.5970 2.1341 15.3493 19.2148 3.8404 12.2275 14.6453 163.3126 27.0670 57.4296 168.2216 34.8664 102.9366 10.5894 31.4757 40.4652 40.7502 8.2137 17.4681 42.3010 34.5109 27.5479 16.3886
temp: 298.150 k
press: 1.00000 atm
elementType: 8 8 8 7 6 6 6 6 6 6 6 6 1 1 1 1 1 1 1 1 1 1 1 1 1 1 1
symmnumber: 1
zpe: 598352.8 jmol-1
zpe.correction: 0.227901 hartree
zpe.thermalcorrener: 0.240853 hartree
zpe.thermalcorrenthalpy: 0.241797 hartree
zpe.thermalcorrgfe: 0.186886 hartree
zpe.sumelectzpe: -593.266341 hartree
zpe.sumelectthermal: -593.253389 hartree
zpe.sumelectthermalent: -593.252445 hartree
zpe.sumelectthermalfe: -593.307356 hartree
dipole: 1.9632 -1.1591 -0.1348
dipole: 2.2838
quadrupole: -73.9440 -72.6417 -72.2220
quadrupole: -7.5015 1.6683 -0.7950
quadrupole: -1.0081 0.2942 0.7139 -7.5015 1.6683 -0.7950
hfenergy: -593.4942419 hartree
pointgroup: C01 [X(C8H15N1O3)]
dipole: -0.7742215 -0.4553226 0.0240296 debye
polarizability: 128.9420979|3.4347607|99.7681768|1.538348|1.2727531|76.9761957 unknown
InChI: InChI=1S/C8H15NO3/c1-11-8(10)2-3-9-4-6-12-7-5-9/h2-7H2,1H3
charge 0 multiplicity 1
27 atoms
O  4.031938 -0.359534 -0.161414
O  -3.603224 -0.831013 0.111254
O  -2.950733 1.403957 0.094497
N  1.188355 0.183017 0.160603
C  1.670189 -1.05861 -0.501575
C  2.172026 1.280437 -0.0447
C  -0.173897 0.58223 -0.264382
C  3.056729 -1.442773 0.041394
C  3.547437 0.864265 0.499914
C  -1.248738 -0.392316 0.256312
C  -2.646896 0.189637 0.139152
C  -5.017432 -0.384011 0.059797
H  1.732749 -0.927088 -1.612269
H  0.966196 -1.885631 -0.295321
H  1.819858 2.180897 0.493265
H  2.27466 1.54292 -1.128065
H  -0.256798 0.672682 -1.377463
H  -0.386728 1.582482 0.153573
H  2.976983 -1.676355 1.125248
H  3.466553 -2.3132 -0.497243
H  4.308344 1.634223 0.290851
H  3.477169 0.694369 1.596038
H  -1.047353 -0.589825 1.32826
H  -1.23235 -1.368732 -0.256793
H  -5.604518 -1.312777 0.047804
H  -5.196036 0.213009 -0.850176
H  -5.257283 0.22804 0.945538
