program: Gaussian 09
title: 000101397
version: EM64L-G09RevD.01
frameworkgroup: C1[X(C14H12Cl2O2S)]
method: RPBEPBE
basis: SDD
operation: Freq
keyword: #p
keyword: freq=noraman
keyword: PBEPBE/SDD
title: #p freq=noraman PBEPBE/SDD
converged: YES YES NO NO
title: Mulliken charges:
elementType: Cl Cl S O O C C C C C C C C C C C C C C H H H H H H H H H H H H
charge: -0.033876 -0.043507 0.917979 -0.551080 -0.562491 -0.723462 0.562063 0.550741 -0.748983 -0.403089 -0.415600 -0.312522 -0.316702 -0.212620 -0.202734 -0.213809 -0.243566 -0.118435 -0.109488 0.284164 0.256358 0.278219 0.298304 0.238549 0.236487 0.249132 0.295788 0.262545 0.259631 0.261677 0.260325
chargesum: 0.00000
title: Mulliken charges with hydrogens summed into heavy atoms:
elementType: Cl Cl S O O C C C C C C C C C C C C C C
charge: -0.033876 -0.043507 0.917979 -0.551080 -0.562491 -0.439297 0.562063 0.550741 0.083898 -0.164540 -0.179113 -0.063390 -0.020914 0.049925 0.056897 0.047868 0.016760 -0.118435 -0.109488
polarizability: 3.10868972e+02 -1.77528562e+00 1.98075150e+02 -2.57691854e+00 1.44171296e+01 1.62752224e+02
1716.lowfreq: -10.0393 -5.1113 -4.5951 0.0011 0.0018 0.0020 19.3523 22.6940 30.8420
frequency: 19.1577 22.6371 30.7158 48.9772 66.5635 83.9274 116.7486 134.4628 137.4423 160.1359 168.5406 185.7833 193.8750 245.9868 256.7350 289.6608 307.2228 317.0258 330.6830 372.5369 391.9957 404.3978 407.3294 423.0795 485.4013 500.9209 556.6120 565.3739 619.4023 620.9974 659.5677 684.0989 716.9373 726.5151 787.1044 794.1236 824.9427 827.8277 833.3767 844.0777 862.9811 877.8980 949.7388 953.4684 956.4483 968.4185 970.7875 990.1643 998.5021 1000.5455 1074.2964 1076.1468 1093.1923 1109.1409 1126.1500 1183.7217 1191.3666 1201.0049 1220.6165 1289.6377 1293.4644 1306.5039 1319.6454 1370.8493 1388.2282 1402.8005 1410.8120 1415.0493 1420.2376 1477.1047 1479.0210 1573.7249 1576.6156 1591.9984 1596.4770 3030.8132 3064.7104 3124.2707 3136.0022 3152.6190 3167.8684 3172.1449 3172.4101 3175.3450 3175.6193 3186.8677 3194.7045
redmass: 7.2603 7.0836 4.8235 8.2766 4.4749 6.2017 7.4046 1.6829 7.8719 2.8529 3.3295 9.0885 9.2449 4.3796 7.9297 6.5726 6.2067 7.6572 4.9918 7.3169 9.6495 3.6292 2.9047 4.3014 5.5270 3.2068 4.0357 5.2832 7.0775 6.7599 6.9368 5.9336 3.9395 3.5740 5.8189 4.8986 1.4443 1.2906 1.4213 1.7370 3.9509 3.1093 1.3390 1.3373 1.3305 1.3745 1.3723 1.7838 4.0050 3.8540 2.6599 2.9787 1.2395 1.4250 1.3352 2.7793 1.1948 1.1385 1.4431 1.2670 1.4570 1.2950 2.2285 6.6303 5.2861 3.0697 1.0908 1.9804 1.0574 2.2728 2.5026 6.7934 7.2382 6.0933 6.0594 1.0247 1.0869 1.0901 1.0900 1.0899 1.0903 1.0956 1.0955 1.0967 1.1067 1.1076 1.0945
irintensity: 1.6244 5.0860 0.0665 1.4561 0.7134 2.7488 1.2786 1.2942 4.7705 3.3978 5.7300 1.3363 0.4156 1.8986 7.7503 5.3424 1.3588 11.8680 2.2664 32.1335 28.1231 3.8404 1.3554 2.2190 14.8755 20.6304 9.0744 88.0778 2.1846 1.5460 16.7256 8.4744 1.6455 10.7845 24.0597 55.7802 9.7807 0.8522 20.5481 53.0755 19.5960 27.2349 10.9227 2.0676 32.3286 0.3487 3.1438 51.5352 60.6648 10.7480 86.6127 32.8217 11.9350 2.1513 10.7058 0.7301 5.6759 0.5524 9.2951 16.4816 12.9457 2.3336 12.5652 0.6346 0.9296 21.5249 10.1731 12.7922 11.7853 29.7644 96.4873 5.2017 2.5018 82.4697 26.3482 1.3664 4.7628 7.2159 6.0608 1.6284 1.1016 0.6486 3.9101 2.9319 0.8772 1.3960 1.0638
temp: 298.150 k
press: 1.00000 atm
elementType: 17 17 16 8 8 6 6 6 6 6 6 6 6 6 6 6 6 6 6 1 1 1 1 1 1 1 1 1 1 1 1
symmnumber: 1
zpe: 577993.9 jmol-1
zpe.correction: 0.220146 hartree
zpe.thermalcorrener: 0.239406 hartree
zpe.thermalcorrenthalpy: 0.240350 hartree
zpe.thermalcorrgfe: 0.169258 hartree
zpe.sumelectzpe: -2007.799843 hartree
zpe.sumelectthermal: -2007.780584 hartree
zpe.sumelectthermalent: -2007.779640 hartree
zpe.sumelectthermalfe: -2007.850732 hartree
dipole: -3.8641 -1.1082 3.4815
dipole: 5.3179
quadrupole: -142.7879 -142.8830 -125.4669
quadrupole: -14.7137 -1.9008 8.9136
quadrupole: -5.7420 -5.8371 11.5790 -14.7137 -1.9008 8.9136
hfenergy: -2008.0199897 hartree
pointgroup: C01 [X(C14H12Cl2O2S1)]
dipole: 1.543923 0.6197988 1.2687075 debye
polarizability: 310.7566267|-4.3510161|192.5181015|1.4663479|-19.4416565|168.4216177 unknown
InChI: InChI=1S/C14H12Cl2O2S/c1-19(17,18)14(10-2-6-12(15)7-3-10)11-4-8-13(16)9-5-11/h2-9,14H,1H3
charge 0 multiplicity 1
31 atoms
Cl 5.392349 1.917644 -0.743844
Cl -5.469363 1.957858 -0.598852
S  -0.051045 -2.484028 0.009441
O  -1.244918 -3.321608 0.746781
O  -0.018518 -2.346729 -1.627893
C  -0.02636 -0.497633 0.816831
C  1.268779 0.10871 0.395497
C  -1.351739 0.074609 0.41676
C  1.609419 -3.314116 0.500116
C  2.370361 0.049064 1.298148
C  -2.218224 0.526995 1.448579
C  1.46383 0.737367 -0.865984
C  -1.789195 0.170166 -0.934848
C  3.624705 0.597446 0.964811
C  -3.467971 1.108634 1.151229
C  2.714348 1.285499 -1.216236
C  -3.042776 0.736036 -1.243691
C  3.779146 1.207194 -0.296735
C  -3.857787 1.210984 -0.197822
H  -0.017285 -0.782387 1.88215
H  1.623108 -3.39584 1.595739
H  2.421629 -2.69269 0.101614
H  1.565937 -4.299663 0.015317
H  2.238997 -0.414367 2.283828
H  -1.911862 0.432233 2.496645
H  0.640146 0.810457 -1.578587
H  -1.188667 -0.264868 -1.739676
H  4.460539 0.558647 1.668889
H  -4.1255 1.464167 1.94929
H  2.858835 1.765214 -2.18831
H  -3.386216 0.791404 -2.280487
