program: Gaussian 09
title: 000101359
version: EM64L-G09RevD.01
frameworkgroup: C1[X(C10H9FO3)]
method: RPBEPBE
basis: SDD
operation: Freq
keyword: #p
keyword: freq=noraman
keyword: PBEPBE/SDD
title: #p freq=noraman PBEPBE/SDD
converged: YES YES NO NO
title: Mulliken charges:
elementType: F O O O C C C C C C C C C C H H H H H H H H H
charge: -0.194450 -0.222367 -0.409873 -0.239704 -0.503865 -0.486688 0.125034 0.293293 -0.309449 -0.315310 -0.384941 -0.371035 0.177593 0.334566 0.255204 0.256906 0.275099 0.274069 0.257485 0.284605 0.262066 0.263553 0.378210
chargesum: 0.00000
title: Mulliken charges with hydrogens summed into heavy atoms:
elementType: F O O O C C C C C C C C C C
charge: -0.194450 -0.222367 -0.031664 -0.239704 0.008244 0.062480 0.125034 0.293293 -0.051963 -0.030705 -0.122875 -0.107482 0.177593 0.334566
polarizability: 1.69263038e+02 9.08232438e+00 1.20814112e+02 1.49378721e-01 -4.01192041e-02 5.50319509e+01
1716.lowfreq: -17.5796 -3.0088 -1.4280 -0.0007 -0.0006 0.0004 8.5514 34.2140 67.0961
frequency: -17.3476 34.1867 67.0930 70.3656 86.0160 117.0174 183.7322 219.5745 284.2843 292.1145 368.6921 411.3276 418.1117 478.3070 497.8651 507.7327 561.4931 564.3213 588.8793 625.0521 641.0408 721.5490 739.0261 792.9450 807.7269 823.4062 851.3238 889.5012 956.5639 981.2301 987.9094 1004.5585 1015.8945 1050.3157 1104.8725 1107.5880 1145.0089 1156.6578 1203.6790 1210.6449 1250.2128 1269.5899 1293.6989 1314.7371 1374.4777 1382.1978 1411.9856 1433.1181 1440.0580 1492.9761 1571.0237 1600.9119 1613.4994 1661.8968 2989.0297 3020.0825 3035.4734 3071.5208 3154.3753 3158.6046 3178.6309 3181.5300 3513.2763
redmass: 8.7919 5.1294 7.9826 4.2307 2.4226 3.8680 6.9649 8.4602 6.2692 9.6262 8.4425 2.9499 5.7043 3.1004 1.7888 4.0910 2.1934 6.6324 5.9515 7.1840 1.3071 3.3272 6.3610 1.6947 6.7128 1.2803 1.5463 3.8850 1.3640 5.5070 1.3635 2.5716 2.2967 2.4373 1.7367 1.7015 1.2067 1.4188 2.0580 2.0040 1.9197 1.1132 1.2855 2.4000 2.5050 3.9626 4.1197 1.1033 1.1181 2.5761 8.4438 7.3077 7.1388 8.1455 1.0615 1.0617 1.0976 1.0986 1.0890 1.0891 1.0964 1.0974 1.0640
irintensity: 3.8084 0.0152 1.0065 3.0456 1.0394 0.6590 9.6381 0.4259 0.6670 2.4988 1.3514 0.0089 19.8948 6.1698 30.5927 56.0314 14.8168 39.7111 2.7594 0.4476 127.2528 1.6196 0.1178 62.7802 21.1185 1.2417 50.6368 0.6116 0.4421 5.1006 0.1936 12.4417 1.4622 308.3508 25.5550 20.8436 0.0398 78.1231 6.0431 59.1527 56.4554 0.7977 4.3220 292.2774 27.8653 2.6143 14.1676 17.2980 37.9577 24.0481 143.4228 97.4832 52.9646 176.7214 17.2932 9.8535 3.9150 6.1408 5.5530 0.1016 2.8234 3.8314 24.8481
temp: 298.150 k
press: 1.00000 atm
elementType: 9 8 8 8 6 6 6 6 6 6 6 6 6 6 1 1 1 1 1 1 1 1 1
symmnumber: 1
zpe: 442501.7 jmol-1
zpe.correction: 0.168540 hartree
zpe.thermalcorrener: 0.180715 hartree
zpe.thermalcorrenthalpy: 0.181660 hartree
zpe.thermalcorrgfe: 0.128462 hartree
zpe.sumelectzpe: -710.973368 hartree
zpe.sumelectthermal: -710.961193 hartree
zpe.sumelectthermalent: -710.960249 hartree
zpe.sumelectthermalfe: -711.013446 hartree
dipole: 0.5655 -0.9569 0.0510
dipole: 1.1126
quadrupole: -78.4167 -86.0431 -80.4158
quadrupole: -3.9043 0.1199 -0.1802
quadrupole: 3.2085 -4.4179 1.2094 -3.9043 0.1199 -0.1802
hfenergy: -711.1419082 hartree
pointgroup: C01 [X(C10H9F1O3)]
dipole: 0.2245498 -0.3751518 0.0214019 debye
dipolederiv: -1.1892311 -0.28974 0.002182 -0.3055411 -0.2987797 0.0012753 0.0022823 0.0012609 -0.1482274 -0.8473916 -0.1073451 0.0008035 -0.3632958 -0.8330244 0.0061935 0.0045054 0.0056243 -0.3009443 -1.303129 -0.4076215 -0.0149413 -0.3340979 -0.3912343 -0.0022653 -0.0152567 -0.0026235 -0.4293476 -0.7539599 0.0724918 -0.000843 -0.159951 -0.9330737 -0.0147588 -0.0065136 -0.0117568 -0.3101796 -0.2632945 0.1210038 -0.0022591 0.3575452 -0.1960808 0.0028756 -0.0024521 0.0010651 0.1389517 -0.1407383 0.0903878 -0.0005956 0.2941244 -0.186896 -0.0016477 -0.0037326 0.00066 0.1235003 1.7940408 0.1659023 0.0001941 0.2218963 0.8829504 -0.0087431 -0.000214 -0.0080295 0.1185881 -0.8687454 -0.1611971 0.0012049 -0.0959557 -0.1959803 0.0015413 -0.0004114 0.0016879 -0.0380682 0.2196309 0.0248131 -0.0000821 0.1585254 0.1010617 -0.0020271 -0.0018179 -0.001914 -0.1133195 0.1878122 0.0928425 -0.0007502 -0.1181881 0.0655218 -0.0013614 0.0017567 -0.0014435 -0.0887348 -0.4675982 -0.0367088 0.0002222 0.2091696 0.0242892 -0.0015537 -0.0020718 -0.0016417 -0.1584238 -0.1901092 -0.1466361 0.0013812 -0.3287611 -0.1847517 0.0000786 0.003142 0.0001527 -0.1602427 1.7252145 0.1510544 0.015358 0.198235 1.240141 0.0229669 0.0196329 0.0204991 0.1883244 1.3373669 0.2938577 -0.0021004 0.2794423 0.4481813 -0.0030523 -0.0019473 -0.0030138 0.1128513 0.0452411 -0.0200699 0.0392751 -0.0778414 0.0439121 0.0750593 0.0490034 0.0744249 -0.0070178 0.0501751 -0.0203324 -0.0383635 -0.0806077 0.0433293 -0.0750086 -0.0483975 -0.0734202 -0.0028013 0.0749061 0.0116887 0.0228099 -0.0616999 0.0808707 0.0664155 0.0229126 0.0675547 0.0131335 0.0700497 0.0102743 -0.0235354 -0.0599578 0.0797186 -0.0670368 -0.0205281 -0.0697752 0.012034 0.0227024 0.0909852 -0.0009157 0.1058411 0.0363101 0.0010175 -0.0010385 0.0009839 0.1406949 0.13854 -0.0439639 0.0003541 0.0061872 0.0128815 0.0012689 -0.0002016 0.0012943 0.1518993 0.0777631 -0.0325023 0.0002808 -0.0481539 -0.0234679 0.001911 0.0004001 0.001874 0.182052 -0.0016241 0.0598069 -0.0006709 0.0663719 0.0511177 0.0012725 -0.0007626 0.0012396 0.1816041 0.2823784 0.0810089 0.0009915 0.136713 0.1330032 -0.0044211 0.0017105 -0.0047032 0.3936733 unknown
polarizability: 169.1613563|9.34962|120.9146151|0.0660377|-0.2940607|55.0331295 unknown
InChI: InChI=1S/C10H9FO3/c11-8-3-1-7(2-4-8)9(12)5-6-10(13)14/h1-4,13H,5-6H2
charge 0 multiplicity 1
23 atoms
F  -4.992511 -0.898082 0.00757
O  0.66963 2.114537 -0.020497
O  5.325371 0.148131 0.019859
O  3.965916 -1.732416 -0.030306
C  1.573551 -0.147109 0.006382
C  2.951512 0.528232 0.003877
C  0.43095 0.869795 -0.006187
C  -0.982348 0.362971 -0.001926
C  -1.29961 -1.023319 0.010975
C  -2.038374 1.31651 -0.011653
C  -2.641881 -1.454214 0.014177
C  -3.383611 0.90641 -0.008535
C  4.075578 -0.48535 -0.004167
C  -3.652134 -0.47578 0.004363
H  1.472735 -0.805047 0.891647
H  1.478308 -0.821328 -0.867131
H  3.065806 1.195075 -0.870428
H  3.073185 1.191862 0.879206
H  -0.505094 -1.775815 0.018293
H  -1.77264 2.378317 -0.021689
H  -2.908381 -2.514695 0.023922
H  -4.208556 1.624221 -0.015847
H  6.043597 -0.541604 0.010893
