program: Gaussian 09
title: 000101525
version: EM64L-G09RevD.01
frameworkgroup: C1[X(C15H12F4N4O7S)]
method: RPBEPBE
basis: SDD
operation: Freq
keyword: #p
keyword: freq=noraman
keyword: PBEPBE/SDD
title: #p freq=noraman PBEPBE/SDD
converged: YES YES NO NO
title: Mulliken charges:
elementType: S F F F F O O O O O O O N N N N C C C C C C C C C C C C C C C H H H H H H H H H H H H
charge: 1.019661 -0.159669 -0.174902 -0.176972 -0.155432 -0.481706 -0.513472 -0.298797 -0.225632 -0.210186 -0.228546 -0.229117 -0.655694 -0.415030 -0.090204 -0.150892 -0.160742 0.310112 -0.201101 -0.332211 -0.223142 -0.209702 0.182218 0.356479 0.053719 0.313123 0.287200 -0.412665 -0.514641 0.150803 0.172791 0.310754 0.360626 0.279501 0.253931 0.249233 0.349500 0.295990 0.224513 0.268450 0.268132 0.274321 0.239395
chargesum: 0.00000
title: Mulliken charges with hydrogens summed into heavy atoms:
elementType: S F F F F O O O O O O O N N N N C C C C C C C C C C C C C C C
charge: 1.019661 -0.159669 -0.174902 -0.176972 -0.155432 -0.481706 -0.513472 -0.298797 -0.225632 -0.210186 -0.228546 -0.229117 -0.295068 -0.065530 -0.090204 -0.150892 -0.160742 0.310112 0.109653 -0.052709 0.030789 0.039531 0.182218 0.356479 0.053719 0.313123 0.287200 -0.116675 0.246456 0.425124 0.412185
polarizability: 2.98583402e+02 2.73866155e+01 2.82371696e+02 8.49823533e+00 -7.82969558e+00 1.84428508e+02
1716.lowfreq: -9.0546 -3.4802 0.0009 0.0010 0.0012 1.3730 7.5647 13.4738 21.1400
frequency: 4.2213 13.4484 21.0677 28.8035 29.4868 33.9947 39.7734 46.7827 50.3394 61.2786 62.9561 67.7784 86.3479 88.9790 100.2287 114.7715 126.5333 153.7278 167.8228 180.2404 199.1412 213.4671 218.2478 224.0790 229.9277 234.1826 260.0521 268.7359 295.7323 322.1029 326.6215 333.8781 355.9006 358.6455 375.0849 397.7493 426.4272 435.9663 454.0174 474.8204 485.8535 503.7699 522.1484 526.4029 555.6254 569.4730 618.6851 626.9442 644.0109 650.7772 662.5272 669.1268 673.9520 679.4426 694.8397 742.6203 747.2733 767.7130 772.1230 788.2744 791.0924 826.1292 842.3961 897.2294 906.6406 907.8962 928.4818 952.2678 966.4105 967.6550 979.6623 980.8773 984.5735 986.2529 1009.0080 1027.0309 1029.6292 1032.8094 1038.1292 1077.6139 1083.6715 1115.4700 1121.6364 1131.6770 1142.3519 1156.1530 1178.7042 1241.9916 1266.5174 1270.6145 1272.5332 1276.8415 1299.5715 1313.1413 1318.3113 1332.8821 1376.1540 1376.9349 1411.5470 1422.7418 1439.5383 1454.0499 1458.5797 1475.5605 1492.0722 1552.7006 1562.0085 1565.9612 1603.9323 1634.8378 1646.4438 3009.4225 3118.5670 3123.3144 3124.8008 3142.1868 3149.0097 3161.0103 3170.3387 3181.2175 3228.2431 3522.2147 3540.4973
redmass: 8.5350 9.2633 4.4364 2.4846 10.6701 10.3952 7.8083 7.7370 3.3349 3.3383 5.4155 12.1839 11.0346 4.2370 4.8486 8.7134 5.3683 6.8010 7.8379 7.8830 8.9417 6.9491 8.5289 12.5627 7.0755 11.6889 6.1799 7.9687 6.1811 7.4389 5.0501 1.9369 7.6629 7.4011 6.1285 9.7482 4.9998 10.8254 8.8111 8.6009 5.2360 10.8508 10.4038 5.1705 7.7695 7.6857 1.5939 6.7311 7.6366 8.1689 4.5807 5.5543 5.8632 4.3630 6.7916 3.6816 6.5707 5.6882 3.2406 1.6821 7.1410 16.0225 1.6344 1.7233 9.0896 3.8416 9.8948 8.6335 8.4619 8.9444 2.9958 2.0299 7.6947 7.5809 1.3733 5.5344 3.3733 3.7406 5.2616 2.7505 4.1887 1.4987 1.4874 2.2996 2.0334 1.4926 1.0635 2.5367 1.3309 1.6680 1.2400 2.0067 1.2754 2.3025 1.5529 2.8742 5.4741 5.1934 1.1934 2.3243 2.8836 1.0587 2.4253 1.0534 4.1987 8.6318 5.8629 7.0795 7.0907 10.3851 8.8305 1.0281 1.0909 1.0890 1.1054 1.1059 1.0869 1.0904 1.0949 1.1008 1.0959 1.0783 1.0767
irintensity: 0.5617 0.7775 0.5091 1.7396 0.8374 3.9656 1.0841 2.1755 0.3555 5.3806 10.7094 1.2346 0.7816 3.4619 1.2996 3.4229 0.9298 0.3599 5.4625 1.1528 5.4506 3.5885 2.9230 0.7866 4.9837 1.3843 16.3761 1.5716 5.4445 31.7500 15.8922 69.5725 10.7992 17.8884 21.5152 14.8540 4.0174 5.1989 128.0280 1.3571 26.8795 7.8082 14.4337 5.8450 151.0728 16.7408 51.1041 4.3825 3.2564 5.8089 18.9204 26.9189 8.2683 50.8808 11.9164 7.0141 47.2199 16.8669 82.5478 28.4758 12.1804 140.6468 47.2871 10.9447 283.9963 13.9461 22.8967 227.4132 234.6276 115.3238 69.2496 19.5694 104.0920 48.8253 0.2660 762.7510 57.8820 80.5457 256.4260 41.0560 35.0362 4.6940 19.0499 215.9155 575.0100 14.6110 0.2539 229.0218 191.2628 31.9969 45.0582 83.9544 194.5620 169.9098 106.0816 267.5646 77.9125 111.0896 51.3758 22.6779 28.4046 15.7562 3.1318 15.5296 642.7409 652.6954 5.1281 345.8833 13.7194 226.2098 216.1029 26.0166 3.4102 11.7169 10.5079 9.3992 3.6477 4.2390 1.8366 14.2154 9.0499 41.8156 58.6742
temp: 298.150 k
press: 1.00000 atm
elementType: 16 9 9 9 9 8 8 8 8 8 8 8 7 7 7 7 6 6 6 6 6 6 6 6 6 6 6 6 6 6 6 1 1 1 1 1 1 1 1 1 1 1 1
symmnumber: 1
zpe: 720048.3 jmol-1
zpe.correction: 0.274252 hartree
zpe.thermalcorrener: 0.305120 hartree
zpe.thermalcorrenthalpy: 0.306064 hartree
zpe.thermalcorrgfe: 0.204250 hartree
zpe.sumelectzpe: -2119.347222 hartree
zpe.sumelectthermal: -2119.316354 hartree
zpe.sumelectthermalent: -2119.315410 hartree
zpe.sumelectthermalfe: -2119.417224 hartree
dipole: 1.4573 -0.3438 1.6542
dipole: 2.2312
quadrupole: -207.6034 -185.4299 -194.5934
quadrupole: 19.1200 13.6214 -8.7820
quadrupole: -11.7279 10.4457 1.2822 19.1200 13.6214 -8.7820
hfenergy: -2119.6214742 hartree
pointgroup: C01 [X(C15H12F4N4O7S1)]
dipole: 0.519681 -0.2923831 0.6441981 debye
polarizability: 296.9562759|23.1825607|279.63085|23.1055847|15.8689565|188.7964797 unknown
InChI: InChI=1S/C15H12F4N4O7S/c1-28-11(24)7-4-2-3-5-8(7)31(26,27)23-15(25)22-14-20-9(29-12(16)17)6-10(21-14)30-13(18)19/h2-6,12-13,22-23H,1H3
charge 0 multiplicity 1
43 atoms
S  2.950745 -1.117367 -1.516499
F  -2.017631 4.903724 0.776358
F  -1.399004 3.392267 2.358026
F  -5.674785 -3.121668 0.106252
F  -7.059986 -2.325568 -1.514697
O  2.933093 -0.363665 -2.942128
O  3.635907 -2.576633 -1.385079
O  2.822886 -2.298459 1.316175
O  4.861801 -2.104535 2.436906
O  0.520745 0.824773 -1.231098
O  -3.146793 2.941851 0.902505
O  -5.749165 -0.855277 -0.413091
N  1.183219 -1.421776 -1.032763
N  -1.072741 -0.91626 -0.89292
N  -2.08253 1.025506 0.032431
N  -3.392083 -0.888697 -0.670437
C  3.612752 0.127464 -0.216124
C  4.071501 -0.263396 1.061888
C  3.698762 1.43875 -0.705817
C  4.677582 0.745384 1.858164
C  4.277502 2.426406 0.122848
C  4.773522 2.074737 1.39844
C  4.00031 -1.635402 1.661937
C  0.242649 -0.38335 -1.053722
C  -2.209726 -0.214419 -0.500864
C  -3.23067 1.647962 0.380998
C  -4.505811 -0.22626 -0.277648
C  -4.512654 1.078063 0.256686
C  2.744775 -3.734343 1.696501
C  -1.842344 3.526955 1.01451
C  -5.780294 -2.175559 -0.952264
H  3.3312 1.670082 -1.709893
H  1.086042 -2.256154 -0.444441
H  5.066676 0.456586 2.839596
H  4.346491 3.457979 -0.235631
H  5.236382 2.835182 2.035216
H  -1.247483 -1.877686 -1.196612
H  -5.425372 1.5928 0.551376
H  1.677447 -3.944951 1.859094
H  3.328347 -3.916835 2.61223
H  3.147951 -4.323886 0.856592
H  -1.096753 3.088109 0.334336
H  -4.993163 -2.377533 -1.693434
