program: Gaussian 09
title: 000101404
version: EM64L-G09RevD.01
frameworkgroup: C1[X(C13H10ClN3O6S)]
method: RPBEPBE
basis: SDD
operation: Freq
keyword: #p
keyword: freq=noraman
keyword: PBEPBE/SDD
title: #p freq=noraman PBEPBE/SDD
converged: YES YES NO NO
title: Mulliken charges:
elementType: Cl S O O O O O O N N N C C C C C C C C C C C C C H H H H H H H H H H
charge: -0.001109 0.931787 -0.496925 -0.490515 -0.183181 -0.190553 -0.229746 -0.203026 -0.544620 0.026816 0.027512 0.197764 -0.006045 0.313303 0.381017 -0.245542 -0.203092 0.452324 -0.364017 -0.379990 -0.348925 -0.347444 -0.094992 -0.795997 0.357637 0.286272 0.300148 0.249673 0.250721 0.318577 0.317068 0.235294 0.232769 0.247034
chargesum: 0.00000
title: Mulliken charges with hydrogens summed into heavy atoms:
elementType: Cl S O O O O O O N N N C C C C C C C C C C C C C
charge: -0.001109 0.931787 -0.496925 -0.490515 -0.183181 -0.190553 -0.229746 -0.203026 -0.186982 0.026816 0.027512 0.197764 -0.006045 0.313303 0.381017 0.040730 0.097056 0.452324 -0.114344 -0.129268 -0.030348 -0.030377 -0.094992 -0.080900
polarizability: 4.01567737e+02 -1.03808883e+00 2.56645940e+02 -1.33706037e+01 -7.08219799e+00 1.19712248e+02
1716.lowfreq: -3.0650 -0.0024 -0.0004 0.0012 1.6486 5.1485 12.6339 17.2766 21.7140
frequency: 12.5583 17.1637 21.6792 36.6563 40.4451 55.5404 68.0097 96.4264 121.6001 129.9779 138.1445 146.2197 167.9763 175.5071 185.4916 202.7990 225.7225 242.5822 288.4660 298.1189 322.7972 336.3447 354.9938 361.1106 379.6279 390.2959 408.2054 423.9321 425.5518 447.1029 470.2813 486.7611 512.8780 543.7514 582.7156 618.8948 637.9248 644.6692 683.8036 691.5610 698.3805 699.8248 725.3570 768.4978 776.7835 813.7508 823.8117 835.1603 840.6480 859.5043 878.2952 920.0471 946.1932 956.0587 961.3628 977.3824 985.0379 993.3865 1045.7557 1049.1238 1085.7386 1126.3699 1129.2597 1144.9754 1167.9916 1191.9081 1199.0917 1221.1071 1281.6248 1300.3016 1302.1269 1340.4079 1364.7528 1383.9490 1392.7118 1397.1411 1399.7015 1428.1645 1454.0171 1469.0407 1470.6875 1474.7172 1545.7838 1589.2113 1592.6816 1595.5838 2982.6749 3066.0185 3096.3126 3142.4380 3145.5098 3168.2174 3180.5430 3184.4788 3185.0996 3185.8777
redmass: 5.3748 1.4949 2.5119 8.7958 12.8757 9.2561 4.9514 13.8553 7.8901 6.2902 8.7834 11.0342 15.7787 14.8574 5.4488 10.3790 8.4035 10.4241 5.7657 4.8064 11.5931 11.0941 10.8148 10.0254 3.7930 8.7436 2.8947 10.8476 7.6668 7.0855 6.7307 4.6900 4.2717 3.7747 6.0738 6.9457 9.6091 5.2343 10.1105 12.7311 5.6217 4.1024 8.2023 7.0930 4.9761 4.7692 1.4841 1.2920 2.1937 7.2103 2.8660 1.4593 1.3812 1.3165 6.2269 1.4677 5.6791 1.4275 2.4205 1.6043 2.0392 1.5863 2.5372 2.3666 6.0460 1.1345 8.0265 3.1774 1.7784 3.5855 1.2732 4.8546 9.2635 6.6149 2.8377 3.9885 1.2161 3.7466 4.2456 1.3892 1.5919 1.0704 6.5907 5.9408 6.8257 7.8893 1.0393 1.0944 1.1002 1.0893 1.0907 1.0963 1.0783 1.0911 1.0930 1.0952
irintensity: 0.6376 1.0057 1.2390 0.3430 0.6972 0.3451 0.1806 0.9562 2.5713 3.9228 2.3797 2.0114 0.3780 0.9221 0.5880 7.6941 8.1171 12.9932 15.7896 9.0595 0.7322 0.1884 3.0201 8.4722 4.5295 12.4563 0.6352 183.6900 8.3098 1.5648 32.3597 2.0544 125.6819 13.8721 45.4336 0.4166 15.1176 10.6113 19.3309 82.5424 6.6270 2.0178 9.9676 68.2241 5.8720 73.7651 25.0808 5.2637 136.2717 5.4292 59.4433 34.1567 0.4879 2.0638 24.0371 2.2125 0.8372 1.6972 40.0849 29.6169 19.6588 45.8844 19.3994 76.8553 290.9994 22.3722 142.0964 12.6311 112.4482 73.1591 5.2092 103.9081 50.0485 2.1057 13.6981 37.8859 18.8362 93.2237 388.6858 17.9423 19.5069 14.6882 73.3655 20.8499 0.4446 1.7423 19.4613 16.5899 12.8243 9.6150 8.6349 5.1207 110.6631 58.1882 6.7845 5.3874
temp: 298.150 k
press: 1.00000 atm
elementType: 17 16 8 8 8 8 8 8 7 7 7 6 6 6 6 6 6 6 6 6 6 6 6 6 1 1 1 1 1 1 1 1 1 1
symmnumber: 1
zpe: 576210.5 jmol-1
zpe.correction: 0.219467 hartree
zpe.thermalcorrener: 0.242551 hartree
zpe.thermalcorrenthalpy: 0.243495 hartree
zpe.thermalcorrgfe: 0.162783 hartree
zpe.sumelectzpe: -1973.027318 hartree
zpe.sumelectthermal: -1973.004234 hartree
zpe.sumelectthermalent: -1973.003290 hartree
zpe.sumelectthermalfe: -1973.084002 hartree
dipole: 4.4304 -1.4604 -2.9250
dipole: 5.5061
quadrupole: -113.5363 -169.8844 -161.8747
quadrupole: 5.0179 -6.8169 -0.7847
quadrupole: 34.8955 -21.4526 -13.4429 5.0179 -6.8169 -0.7847
hfenergy: -1973.2467848 hartree
pointgroup: C01 [X(C13H10Cl1N3O6S1)]
dipole: -1.8055044 0.7766955 -0.9107869 debye
polarizability: 402.0950439|3.2285807|244.2542504|2.5227427|40.1763348|131.5766304 unknown
InChI: InChI=1S/C13H10ClN3O6S/c1-8-2-4-10(5-3-8)24(22,23)15-13-11(16(18)19)6-9(14)7-12(13)17(20)21/h2-7,15H,1H3
charge 0 multiplicity 1
34 atoms
Cl 5.876277 1.749842 0.2302
S  -0.87731 -0.766382 1.193611
O  -0.886378 -2.364297 1.478562
O  -0.331518 0.286565 2.295531
O  3.878899 -2.804471 -1.370199
O  0.965953 3.334783 0.965348
O  1.608362 -2.728204 -1.443863
O  -0.456098 1.943457 -0.130009
N  0.352888 -0.699429 -0.353358
N  2.76823 -2.18349 -1.176442
N  0.701417 2.223859 0.36662
C  1.588914 -0.100125 -0.272496
C  -2.575378 -0.288289 0.553772
C  2.805809 -0.812003 -0.640256
C  1.81005 1.259548 0.172631
C  -3.324588 -1.307679 -0.057859
C  -3.04563 1.015626 0.766221
C  -5.158986 0.324081 -0.308797
C  -4.62589 -0.980112 -0.493967
C  -4.354885 1.306989 0.327811
C  4.093022 -0.253145 -0.50268
C  3.096649 1.803487 0.342292
C  4.227752 1.038845 0.01665
C  -6.571133 0.651593 -0.753562
H  0.401082 -1.678991 -0.718918
H  -2.920795 -2.318658 -0.168842
H  -2.421512 1.77203 1.24771
H  -5.234908 -1.750777 -0.979241
H  -4.751549 2.316847 0.47912
H  4.95647 -0.853792 -0.799706
H  3.180606 2.832462 0.701254
H  -6.669609 1.711608 -1.043869
H  -6.883091 0.029032 -1.609515
H  -7.291224 0.467588 0.067147
