program: Gaussian 09
title: 000101430
version: EM64L-G09RevD.01
frameworkgroup: C1[X(C16H17N5O4)]
method: RPBEPBE
basis: SDD
operation: Freq
keyword: #p
keyword: freq=noraman
keyword: PBEPBE/SDD
title: #p freq=noraman PBEPBE/SDD
converged: YES YES NO NO
title: Mulliken charges:
elementType: O O O O N N N N N C C C C C C C C C C C C C C C C H H H H H H H H H H H H H H H H H
charge: -0.284105 -0.448407 -0.466927 -0.436093 -0.161127 -0.090884 -0.067894 -0.435594 -0.084877 -0.141893 -0.049786 -0.254494 -0.038287 -0.338669 0.164698 -0.207322 -0.146585 0.185513 -0.372353 0.465091 -0.454368 -0.338048 -0.196950 -0.219156 -0.254773 0.250815 0.252463 0.301010 0.260510 0.209578 0.220556 0.370068 0.367271 0.276629 0.353909 0.245522 0.341105 0.225907 0.315199 0.227503 0.225708 0.229536
chargesum: 0.00000
title: Mulliken charges with hydrogens summed into heavy atoms:
elementType: O O O O N N N N N C C C C C C C C C C C C C C C C
charge: -0.284105 -0.078338 -0.099655 -0.082184 -0.161127 -0.090884 -0.067894 -0.094489 -0.084877 0.108922 0.202676 0.046516 0.222223 0.091465 0.164698 0.069307 -0.146585 0.185513 -0.126831 0.465091 -0.228461 -0.022849 0.030553 0.006552 -0.025237
polarizability: 3.79191131e+02 -1.30717178e+01 2.06373673e+02 9.13940036e+00 3.08783929e+01 1.35198091e+02
1716.lowfreq: -7.5502 -1.8345 -0.0011 -0.0008 -0.0006 3.0915 20.6717 27.7750 35.8344
frequency: 20.6257 27.7293 35.8135 51.0842 59.8827 73.5149 83.0043 96.8501 124.6486 148.8422 177.1692 183.6837 212.6417 234.5930 249.5808 268.4944 288.2304 295.7392 300.1618 308.3751 338.7855 368.3474 395.1521 409.4890 445.7839 490.3722 507.5472 510.5210 533.8293 558.5565 565.7930 576.0589 592.9840 614.9113 638.2542 653.2886 658.2770 686.0547 697.2159 723.5682 727.6755 768.1037 771.2086 792.9692 802.1019 803.6635 811.4899 827.2850 846.3077 867.7561 876.3488 921.0755 925.0168 927.2832 973.4896 975.2548 984.0918 988.4514 996.7762 1003.9587 1013.3531 1020.4956 1028.2230 1041.5499 1064.8775 1083.6590 1105.2665 1110.8841 1153.9677 1169.3456 1172.0816 1182.5807 1187.9973 1199.6686 1213.0491 1234.9589 1255.1529 1265.7871 1271.7140 1292.3625 1299.8063 1306.2661 1311.8000 1314.8737 1321.0393 1338.9944 1347.8713 1369.9517 1371.6173 1383.1537 1387.6990 1394.0960 1396.4905 1422.0657 1447.1214 1456.7125 1460.3249 1487.5474 1513.3199 1544.1409 1587.5390 1613.5954 1622.1137 2969.7483 3016.0142 3027.9394 3056.6628 3058.2628 3077.7530 3112.6791 3132.3810 3145.1640 3160.9840 3165.9474 3189.5891 3232.7393 3409.1235 3487.8465 3551.5557 3596.0501
redmass: 6.6458 5.1223 7.0316 4.6773 6.0406 6.8599 5.8078 3.7227 6.0955 7.3521 4.0641 5.3822 6.4261 3.8601 2.5132 6.8372 5.5669 3.3614 3.9233 2.3421 6.8223 3.1589 4.3635 2.9507 1.2852 6.4283 3.2130 2.9449 5.9785 4.7126 4.0038 1.9008 2.2064 6.4687 5.2365 6.9530 4.0400 5.0209 1.8393 1.5511 5.0746 8.5504 1.6762 4.7459 3.5109 4.8702 5.8493 1.7624 1.2692 7.9943 3.6641 1.4280 3.8158 1.4573 4.4217 1.3481 5.9197 3.7761 4.9758 1.3053 3.4426 2.5056 2.1152 3.1719 4.1982 1.7170 2.0864 3.8770 2.4546 1.6189 1.0618 1.2347 1.1284 1.7747 1.2900 2.8322 2.1847 1.2630 1.5341 1.3671 2.6522 1.8854 3.8317 1.3440 1.4819 1.3555 1.5224 2.4626 1.9038 1.2777 1.5791 2.9213 1.6848 3.0910 2.7329 2.9329 1.0858 2.1750 4.1831 6.2020 7.1147 4.6312 3.7871 1.0665 1.0871 1.0848 1.0867 1.0879 1.0976 1.0886 1.0868 1.0934 1.0919 1.0997 1.0956 1.0988 1.0645 1.0758 1.0657 1.0669
irintensity: 0.1767 0.9215 0.4043 0.2939 1.8544 1.2673 8.3722 7.2655 0.8712 0.1972 2.0929 2.6322 0.5310 10.8223 24.2602 2.9038 7.0382 9.7740 5.1830 21.3855 5.4709 14.1782 5.9528 0.1528 129.5712 17.3853 1.2014 20.8543 19.5171 0.7093 20.8959 61.6097 55.7194 2.2013 6.0629 23.9864 23.7792 14.7906 31.5454 22.0420 102.7227 12.4887 105.2694 32.0995 34.2711 48.9216 73.0922 11.6496 1.5096 29.1284 14.4427 13.8485 120.0287 16.1608 126.9889 0.0091 12.0885 109.8717 26.9375 2.6751 66.3786 19.5799 14.6779 47.8936 17.5369 8.5580 13.5182 12.1807 30.0598 8.2501 0.4644 19.6135 6.4975 114.1652 4.5600 15.8152 8.0819 13.9573 4.6048 24.3804 52.0320 17.9054 37.9105 80.0740 29.0595 112.1395 26.6025 122.1905 57.5129 21.9325 2.1891 12.8873 14.6164 94.8448 73.2190 18.0477 4.1058 183.5103 17.2455 220.6419 396.8592 319.9180 309.2818 39.6763 54.3697 24.9539 11.1810 7.1793 33.2517 12.3560 0.5518 28.4136 14.7422 29.5372 15.6641 0.6665 67.2398 38.0763 8.8878 23.8394
temp: 298.150 k
press: 1.00000 atm
elementType: 8 8 8 8 7 7 7 7 7 6 6 6 6 6 6 6 6 6 6 6 6 6 6 6 6 1 1 1 1 1 1 1 1 1 1 1 1 1 1 1 1 1
symmnumber: 1
zpe: 849057.4 jmol-1
zpe.correction: 0.323389 hartree
zpe.thermalcorrener: 0.344892 hartree
zpe.thermalcorrenthalpy: 0.345837 hartree
zpe.thermalcorrgfe: 0.270966 hartree
zpe.sumelectzpe: -1192.723351 hartree
zpe.sumelectthermal: -1192.701848 hartree
zpe.sumelectthermalent: -1192.700903 hartree
zpe.sumelectthermalfe: -1192.775774 hartree
dipole: 1.1007 0.2431 -2.8886
dipole: 3.1007
quadrupole: -144.6304 -141.7257 -149.5695
quadrupole: 4.0659 16.8419 15.7567
quadrupole: 0.6781 3.5829 -4.2610 4.0659 16.8419 15.7567
hfenergy: -1193.04674 hartree
pointgroup: C01 [X(C16H17N5O4)]
dipole: -0.5252604 -1.076296 0.2321737 debye
polarizability: 375.8967625|-26.7747496|146.9192761|19.9855553|37.2226448|197.9468561 unknown
InChI: InChI=1S/C16H17N5O4/c22-6-10-12(23)13(24)16(25-10)21-8-19-11-14(17-7-18-15(11)21)20-9-4-2-1-3-5-9/h1-5,7-8,10,12-13,16,20,22-24H,6H2
charge 0 multiplicity 1
42 atoms
O  3.740112 1.082781 0.404034
O  4.786159 -1.580098 1.814952
O  5.231882 -1.994049 -0.764049
O  4.486259 2.377126 -2.044805
N  1.690946 0.326886 1.423438
N  -0.330202 1.120357 2.180557
N  0.902521 -0.759588 -0.692657
N  -2.877285 0.66158 0.637956
N  -1.530551 -0.516579 -0.991622
C  3.624162 -1.2689 0.991842
C  3.150683 0.152757 1.379558
C  4.054521 -1.146039 -0.505416
C  4.47363 0.329366 -0.660218
C  4.096902 0.967475 -1.999314
C  0.734602 -0.057215 0.470066
C  0.989726 1.036378 2.416436
C  -0.499197 0.438495 0.962575
C  -1.669428 0.186911 0.181483
C  -0.281045 -0.939768 -1.352088
C  -4.186377 0.576655 0.091087
C  -5.231457 1.191301 0.835332
C  -4.485367 -0.077214 -1.134449
C  -6.557487 1.15421 0.361779
C  -5.819662 -0.1045 -1.593577
C  -6.861839 0.505103 -0.858076
H  2.83098 -2.024582 1.142744
H  3.536236 0.399861 2.383844
H  3.200199 -1.397253 -1.157187
H  5.557888 0.437558 -0.469031
H  3.006488 0.841801 -2.168697
H  4.655324 0.480275 -2.816955
H  5.465066 -1.977159 1.196819
H  4.952344 -2.842966 -1.187037
H  1.499085 1.461999 3.278654
H  4.070999 2.825126 -1.263223
H  -0.226576 -1.493952 -2.293957
H  -2.797294 1.166067 1.528153
H  -5.003214 1.697397 1.782505
H  -3.676643 -0.54522 -1.697783
H  -7.351991 1.632256 0.94515
H  -6.043641 -0.609788 -2.539873
H  -7.892557 0.476251 -1.226749
