program: Gaussian 09
title: 000101413
version: EM64L-G09RevD.01
frameworkgroup: C1[X(C12H24N6P2S2)]
method: RPBEPBE
basis: SDD
operation: Freq
keyword: #p
keyword: freq=noraman
keyword: PBEPBE/SDD
title: #p freq=noraman PBEPBE/SDD
converged: NO YES NO NO
title: Mulliken charges:
elementType: S S P P N N N N N N C C C C C C C C C C C C H H H H H H H H H H H H H H H H H H H H H H H H
charge: -0.296307 -0.296464 0.665610 0.665971 -0.459044 -0.354282 -0.349884 -0.460056 -0.349218 -0.354727 -0.291866 -0.339324 -0.382404 -0.395253 -0.389162 -0.386349 -0.338450 -0.290908 -0.389582 -0.385824 -0.382924 -0.394836 0.219424 0.258814 0.250612 0.221693 0.250374 0.250294 0.262536 0.249452 0.250615 0.261051 0.252808 0.250007 0.221884 0.250524 0.258706 0.219352 0.261135 0.250628 0.249994 0.252620 0.250572 0.250382 0.249453 0.262353
chargesum: 0.00000
title: Mulliken charges with hydrogens summed into heavy atoms:
elementType: S S P P N N N N N N C C C C C C C C C C C C
charge: -0.296307 -0.296464 0.665610 0.665971 -0.459044 -0.354282 -0.349884 -0.460056 -0.349218 -0.354727 0.186372 0.132981 0.118264 0.116734 0.122504 0.116466 0.133958 0.187150 0.122180 0.116790 0.118030 0.116970
polarizability: 2.97339262e+02 1.25179244e+00 2.34171801e+02 9.08849976e-01 -6.15068865e-03 2.28122978e+02
1716.lowfreq: -7.9701 -4.9817 -0.0018 -0.0007 0.0020 2.8509 11.2124 21.6769 29.1717
frequency: -4.9519 21.6627 28.5162 46.3016 47.7041 51.3764 54.8144 58.5617 62.6378 112.0114 118.4195 120.5408 136.6947 137.9280 152.0732 154.2565 163.9054 174.1674 221.6174 234.3107 264.3722 292.8627 297.6021 314.8618 340.6541 347.2217 351.9655 354.6750 360.8232 379.6420 393.2707 401.8548 403.1703 453.0486 479.5480 557.9405 571.7078 573.6236 605.8976 613.5766 670.5928 685.1609 789.9630 790.4342 799.9434 800.0551 802.9755 803.2581 808.3202 808.9469 839.9281 880.6251 881.1097 892.8561 895.7073 922.3228 932.2427 966.0244 989.5311 989.8430 997.7541 997.9184 1044.4793 1044.5433 1063.2423 1067.0814 1067.6776 1076.7432 1078.2923 1109.6488 1110.1326 1120.0453 1120.1979 1121.3514 1121.7363 1123.2760 1123.7419 1138.6806 1148.3894 1148.5344 1152.7112 1153.0425 1153.5780 1182.6310 1207.7352 1230.8846 1231.0712 1237.4732 1238.0594 1271.2721 1317.2228 1333.3609 1342.0477 1342.8920 1357.0552 1371.9622 1439.5903 1439.7525 1441.7474 1441.9293 1446.1529 1449.3051 1453.2310 1453.6418 1454.1694 1455.6456 1458.4740 1458.7978 2955.9850 2957.4586 2967.3732 2968.8770 3050.1629 3050.2726 3063.8843 3063.9701 3064.9343 3064.9555 3069.4666 3069.5442 3071.4073 3071.5331 3085.9506 3086.2598 3178.9525 3178.9590 3180.0146 3180.0943 3195.3965 3195.4061 3196.5641 3196.6107
redmass: 4.7277 5.6679 4.1113 3.3263 3.0060 3.5903 3.4705 3.8585 5.7746 5.4026 5.2158 3.3666 3.0806 4.7447 4.3182 5.4701 4.3223 4.2930 3.7039 4.1471 2.8614 3.5717 3.8106 3.7579 4.6056 3.0577 4.3150 4.3500 4.3184 3.8246 4.7284 6.5618 2.2638 2.8255 7.7380 2.9320 9.8449 8.1741 9.4083 10.2085 2.8410 5.9900 8.7796 8.8324 1.1169 1.1143 7.5498 7.8036 1.1453 1.1323 1.5688 4.3245 4.3252 4.4909 4.6053 3.1550 2.4863 3.0454 1.0644 1.0642 1.0719 1.0716 1.8415 2.5557 1.9662 1.2526 1.2672 1.2648 1.3133 1.3206 1.3192 1.3099 1.3059 1.2956 1.2928 1.3107 1.2987 2.2008 1.3825 1.3788 2.0392 1.3760 2.2246 7.1353 1.0539 3.3615 3.3645 3.4294 3.4555 1.3348 1.4145 1.2672 1.2425 1.3720 1.2776 1.3702 1.0768 1.0771 1.0751 1.0753 1.0746 1.0839 1.1092 1.1563 1.1493 1.0992 1.1684 1.1653 1.0661 1.0661 1.0646 1.0650 1.0990 1.0989 1.0508 1.0507 1.0512 1.0514 1.0598 1.0598 1.0608 1.0609 1.0962 1.0962 1.1161 1.1161 1.1163 1.1163 1.1163 1.1163 1.1164 1.1164
irintensity: 0.2503 0.1146 0.0020 0.0995 1.2424 0.0218 2.5775 0.0013 2.8007 0.0018 6.0687 0.0654 1.5824 0.0075 27.1773 0.0434 13.0585 0.0029 3.5630 0.0003 11.7037 0.0261 6.4978 7.4851 0.0005 2.9176 0.0031 3.2391 0.0081 32.4601 0.0013 3.6522 0.0720 0.0010 0.0019 45.4841 0.0265 109.1384 167.0326 0.0048 130.2678 0.0103 1.8811 2.2189 1.2070 79.1993 14.9757 23.8316 46.3462 3.4103 0.0004 16.9967 281.6107 225.9670 0.3701 0.0054 12.2847 380.6104 0.7901 0.7736 3.1099 1.9598 1.6049 0.1115 118.3697 0.1869 7.1133 0.2406 62.0739 2.8714 4.1144 3.7039 14.0662 0.3874 4.1396 2.6966 33.9423 0.0036 0.5028 0.0226 21.5063 0.0354 27.5788 0.0001 0.0022 42.7957 67.1645 62.7586 0.8495 74.4322 6.2733 0.0016 0.7978 0.0070 0.0036 41.4765 6.0943 7.6423 12.6535 13.0024 21.1253 0.0067 16.2985 0.3779 4.5255 0.0115 3.2175 17.3186 41.7071 0.2026 4.3757 158.5672 4.6382 8.9462 1.8722 7.0238 43.2558 1.5305 10.3554 71.1863 45.1480 1.2450 13.1510 1.9853 0.1277 0.6880 2.2491 1.9630 3.2507 12.7765 13.8172 11.8119
temp: 298.150 k
press: 1.00000 atm
elementType: 16 16 15 15 7 7 7 7 7 7 6 6 6 6 6 6 6 6 6 6 6 6 1 1 1 1 1 1 1 1 1 1 1 1 1 1 1 1 1 1 1 1 1 1 1 1
symmnumber: 1
zpe: 962447.1 jmol-1
zpe.correction: 0.366577 hartree
zpe.thermalcorrener: 0.391450 hartree
zpe.thermalcorrenthalpy: 0.392395 hartree
zpe.thermalcorrgfe: 0.309661 hartree
zpe.sumelectzpe: -2276.834519 hartree
zpe.sumelectthermal: -2276.809645 hartree
zpe.sumelectthermalent: -2276.808701 hartree
zpe.sumelectthermalfe: -2276.891434 hartree
dipole: 0.0009 0.0065 0.0050
dipole: 0.0083
quadrupole: -150.0434 -145.2789 -177.4819
quadrupole: -0.4692 -21.4232 0.6395
quadrupole: 7.5580 12.3225 -19.8805 -0.4692 -21.4232 0.6395
hfenergy: -2277.2010955 hartree
pointgroup: C01 [X(C12H24N6P2S2)]
dipole: 0.0000357 -0.0018063 -0.0026993 debye
polarizability: 296.3992491|-3.0257845|233.6866858|-7.4086448|2.1847732|229.5481056 unknown
InChI: InChI=1S/C12H24N6P2S2/c21-19(15-5-6-15,16-7-8-16)13-1-2-14(4-3-13)20(22,17-9-10-17)18-11-12-18/h1-12H2
charge 0 multiplicity 1
46 atoms
S  -3.678793 -0.586396 2.286904
S  3.678091 0.589107 -2.284927
P  -3.028641 0.091401 0.405506
P  3.02877 -0.090558 -0.403998
N  -1.337616 0.381445 0.288637
N  -3.368505 -0.965313 -1.011867
N  -3.771289 1.605474 -0.227856
N  1.334701 -0.359719 -0.280299
N  3.759468 -1.615471 0.218806
N  3.384459 0.955831 1.016765
C  -0.720099 0.8268 -0.983519
C  -0.397153 0.179013 1.406462
C  -4.697134 -1.695385 -1.060075
C  -3.420289 -2.459849 -0.76611
C  -4.116333 2.676833 0.789702
C  -5.222414 1.884129 0.120827
C  0.394207 -0.159177 -1.398403
C  0.717891 -0.806222 0.991884
C  4.096663 -2.682262 -0.80651
C  5.208559 -1.902258 -0.132571
C  4.716384 1.680385 1.057673
C  3.440189 2.451491 0.778956
H  -0.286534 1.83887 -0.843936
H  -1.494289 0.877072 -1.766817
H  -0.953749 -0.211955 2.277769
H  0.064787 1.149372 1.683374
H  -5.151559 -1.732178 -2.054363
H  -5.387112 -1.558749 -0.216704
H  -3.283548 -2.810851 0.26582
H  -2.942681 -3.056369 -1.548649
H  -3.887049 3.692974 0.456457
H  -3.923061 2.457263 1.84831
H  -5.745583 1.151474 0.750319
H  -5.801482 2.321082 -0.69782
H  -0.068634 -1.129338 -1.67474
H  0.950578 0.231373 -2.270038
H  1.492236 -0.854989 1.775128
H  0.285563 -1.819017 0.85305
H  3.904688 -2.45397 -1.863509
H  3.860174 -3.698968 -0.480072
H  5.784758 -2.349022 0.682816
H  5.736892 -1.169115 -0.757155
H  5.398338 1.545872 0.207423
H  5.179463 1.710406 2.048172
H  2.971989 3.045697 1.568917
H  3.2963 2.809366 -0.249638
