program: Gaussian 09
title: 000101321
version: EM64L-G09RevD.01
frameworkgroup: C1[X(C15H15NO)]
method: RPBEPBE
basis: SDD
operation: Freq
keyword: #p
keyword: freq=noraman
keyword: PBEPBE/SDD
title: #p freq=noraman PBEPBE/SDD
converged: YES YES NO NO
title: Mulliken charges:
elementType: O N C C C C C C C C C C C C C C C H H H H H H H H H H H H H H H
charge: -0.249925 -0.498480 0.175440 0.333116 0.362584 -0.420085 -0.412095 -0.233985 -0.838868 -0.823438 0.120918 0.263028 -0.347064 -0.380270 -0.225921 -0.233989 -0.228215 0.311046 0.231761 0.232337 0.225305 0.220375 0.247558 0.237934 0.218169 0.289140 0.218697 0.274495 0.233884 0.233160 0.230248 0.233143
chargesum: 0.00000
title: Mulliken charges with hydrogens summed into heavy atoms:
elementType: O N C C C C C C C C C C C C C C C
charge: -0.249925 -0.187434 0.175440 0.333116 0.362584 -0.188324 -0.179759 -0.008680 -0.133002 -0.097432 0.120918 0.263028 -0.072569 -0.146386 0.007239 -0.003741 0.004927
polarizability: 2.58708429e+02 5.05935461e+00 1.46516563e+02 1.58007898e-01 8.15720959e+00 1.19372913e+02
1716.lowfreq: -8.3959 -5.1997 -0.0007 -0.0006 0.0001 6.2791 36.5829 39.3390 57.2392
frequency: 36.5485 39.3224 57.2329 100.2772 127.2673 154.7756 162.7452 187.5271 203.6997 231.0737 250.3955 303.0063 325.3610 328.4160 402.6139 405.2671 455.5272 481.9765 515.6656 519.0943 526.2088 544.8048 599.3812 615.3070 644.6487 687.0857 699.0185 704.6016 734.8158 777.8676 788.4957 827.9550 855.9360 862.4159 898.9141 929.7411 937.5347 974.7174 983.9962 986.9802 989.7145 1004.6133 1023.0063 1039.1693 1044.0361 1050.6139 1073.7585 1086.9058 1105.9169 1173.4745 1177.2040 1187.9297 1223.4484 1250.1275 1263.1829 1279.6847 1316.2064 1369.2255 1384.1094 1396.7976 1398.9266 1430.5399 1437.5141 1449.2213 1456.7895 1468.1356 1472.3367 1479.7509 1485.6632 1494.9606 1578.5973 1602.8513 1605.6223 1609.5650 1613.9850 2957.4681 2977.2431 3037.0073 3058.3824 3086.4336 3089.0274 3120.4050 3121.8143 3131.7793 3132.3639 3144.8333 3157.0902 3157.4264 3169.2349 3517.4511
redmass: 4.3457 3.9766 4.6555 4.3150 4.6873 3.2563 1.1064 1.8163 1.9658 2.3988 3.7851 5.1262 3.1965 3.5020 3.8935 3.4847 3.5620 3.6228 3.0850 4.4229 5.0174 2.9910 1.4692 5.0889 5.7053 5.3009 4.9338 1.5559 4.2895 1.2254 2.3818 4.6682 1.6080 2.8272 1.3091 2.3259 1.5345 1.3396 1.4784 1.6045 4.7162 1.3435 2.5084 1.6849 1.6380 1.5980 2.2883 1.7884 1.8290 1.0588 1.1617 1.1157 4.6482 2.2697 1.9791 2.4314 1.3306 6.4364 9.1815 1.2390 1.2646 2.1139 2.1023 1.7763 1.2816 1.5061 1.1103 1.8706 1.2747 1.5614 6.0140 6.1404 6.2135 5.8629 6.5572 1.0431 1.0364 1.0914 1.0969 1.0998 1.0978 1.0868 1.0857 1.0919 1.0873 1.0922 1.0995 1.0957 1.1009 1.0756
irintensity: 0.4393 0.3975 0.5765 2.9391 2.3075 1.1056 1.3032 2.4834 3.1225 0.9479 6.8708 4.6941 3.1042 2.1094 1.1881 0.4774 0.8592 7.5583 0.4744 0.6533 6.0075 15.8272 55.7305 3.5340 21.7443 11.3406 5.0383 87.3854 9.1108 57.5961 19.6268 6.1518 1.9664 6.6720 0.0820 6.7280 0.9958 0.2127 2.4519 4.2834 0.1409 1.5506 11.1319 5.3150 3.4186 8.0507 6.4809 11.8968 21.2894 0.9768 2.3894 9.8588 0.1193 94.8737 39.1832 34.8871 1.3738 53.5470 1.1483 42.1027 1.9743 23.6489 15.6850 119.0426 22.2504 102.8840 34.2272 35.6358 53.4019 73.1357 42.9587 14.6646 6.6469 14.1339 48.6889 34.3147 24.0230 19.5124 10.0216 24.7654 22.0669 9.3018 0.3863 25.9437 1.9254 21.9360 39.2290 14.7811 22.9078 11.2557
temp: 298.150 k
press: 1.00000 atm
elementType: 8 7 6 6 6 6 6 6 6 6 6 6 6 6 6 6 6 1 1 1 1 1 1 1 1 1 1 1 1 1 1 1
symmnumber: 1
zpe: 680374.7 jmol-1
zpe.correction: 0.259141 hartree
zpe.thermalcorrener: 0.274464 hartree
zpe.thermalcorrenthalpy: 0.275408 hartree
zpe.thermalcorrgfe: 0.216040 hartree
zpe.sumelectzpe: -709.392167 hartree
zpe.sumelectthermal: -709.376844 hartree
zpe.sumelectthermalent: -709.375899 hartree
zpe.sumelectthermalfe: -709.435268 hartree
dipole: 1.2253 2.8302 2.2318
dipole: 3.8069
quadrupole: -83.7040 -97.7977 -101.1610
quadrupole: 1.6227 0.6054 -1.4478
quadrupole: 10.5169 -3.5768 -6.9401 1.6227 0.6054 -1.4478
hfenergy: -709.6513076 hartree
pointgroup: C01 [X(C15H15N1O1)]
dipole: -0.479195 -0.3907778 1.3641676 debye
polarizability: 258.7555532|1.7160602|129.6063091|-4.1892084|-15.4578701|136.236043 unknown
InChI: InChI=1S/C15H15NO/c1-11-7-6-8-12(2)14(11)16-15(17)13-9-4-3-5-10-13/h3-10,16H,1-2H3
charge 0 multiplicity 1
32 atoms
O  -0.38194 0.428312 -1.843237
N  0.26396 -0.025161 0.36635
C  1.690926 -0.012037 0.19744
C  2.418287 -1.160551 0.635989
C  2.356409 1.130857 -0.335985
C  3.826579 -1.159039 0.516292
C  3.768537 1.080311 -0.453271
C  4.502549 -0.048817 -0.035648
C  1.693798 -2.368802 1.205016
C  1.607373 2.381627 -0.743005
C  -0.688903 0.204781 -0.63308
C  -2.124199 0.143749 -0.170424
C  -3.112678 -0.160283 -1.141389
C  -2.522066 0.401628 1.168496
C  -4.472585 -0.233446 -0.776719
C  -3.885383 0.332458 1.531677
C  -4.862664 0.007483 0.562611
H  -0.084882 -0.437556 1.234957
H  4.391614 -2.039121 0.844959
H  4.292426 1.950205 -0.866318
H  5.593758 -0.061989 -0.13204
H  1.218968 -2.153979 2.184768
H  0.895627 -2.720633 0.52496
H  2.395868 -3.203634 1.36642
H  2.297049 3.236889 -0.843428
H  1.085625 2.226401 -1.705053
H  0.829207 2.645522 -0.002456
H  -2.788611 -0.327207 -2.173897
H  -1.78324 0.701792 1.921612
H  -5.227919 -0.474987 -1.532444
H  -4.185927 0.543818 2.563817
H  -5.919664 -0.045792 0.846129
