program: Gaussian 09
title: 000101383
version: EM64L-G09RevD.01
frameworkgroup: C1[X(C16H15NO3)]
method: RPBEPBE
basis: SDD
operation: Freq
keyword: #p
keyword: freq=noraman
keyword: PBEPBE/SDD
title: #p freq=noraman PBEPBE/SDD
converged: YES YES NO NO
title: Mulliken charges:
elementType: O O O N C C C C C C C C C C C C C C C C H H H H H H H H H H H H H H H
charge: -0.280079 -0.449713 -0.213488 -0.393597 -0.547104 0.488266 0.510434 0.265103 -0.424793 -0.443282 -0.381268 -0.338844 -0.227414 -0.225975 -0.240799 -0.233806 -0.392583 -0.243616 -0.244584 0.180602 0.190488 0.222679 0.220021 0.282985 0.252550 0.353464 0.224021 0.223920 0.225491 0.225022 0.284580 0.280273 0.228058 0.227628 0.395356
chargesum: 0.00000
title: Mulliken charges with hydrogens summed into heavy atoms:
elementType: O O O N C C C C C C C C C C C C C C C C
charge: -0.280079 -0.054357 -0.213488 -0.040133 -0.356616 0.488266 0.510434 0.265103 -0.202114 -0.223261 -0.098283 -0.086293 -0.003392 -0.002055 -0.015308 -0.008784 0.172271 -0.015558 -0.016956 0.180602
polarizability: 1.80399312e+02 2.84750871e+00 1.90334960e+02 6.35337649e+00 7.92200297e+00 1.74300131e+02
1716.lowfreq: -10.9162 -0.7877 -0.0006 0.0001 0.0007 3.9337 9.6743 15.2532 38.7091
frequency: 9.1978 14.2544 38.7034 40.9639 42.8699 58.1836 70.7971 111.1768 152.3620 178.7163 224.8957 232.7433 249.7997 280.0212 285.8978 319.8924 401.6609 405.0935 465.5012 477.5920 488.8977 526.2067 545.4545 547.1775 598.0388 614.7090 615.3780 632.3389 649.4705 696.2990 705.9474 709.2100 732.8414 755.6648 781.4677 821.7537 838.9355 842.6036 858.7897 860.7791 911.8500 930.5332 959.6559 967.6066 978.3281 983.5602 989.3150 991.5273 991.7303 1004.0750 1026.7948 1029.4475 1077.8378 1079.4888 1088.3986 1103.4433 1170.6054 1171.6316 1177.1000 1187.3661 1191.8995 1194.1801 1206.2297 1208.9712 1237.0407 1288.3741 1305.4552 1324.5821 1334.6677 1347.5802 1382.0801 1384.3184 1440.2214 1441.4187 1457.3626 1472.3544 1478.1156 1483.9010 1590.8264 1593.0014 1605.7755 1607.8616 1613.8743 1686.4069 2992.1149 2994.4455 3030.1080 3110.1943 3113.4328 3125.8409 3126.6260 3138.4727 3139.9204 3150.5541 3156.9266 3163.2944 3170.9555 3532.1658 3558.0961
redmass: 6.3210 3.9529 3.9521 4.7978 6.8838 4.7423 6.0421 5.9211 5.2682 3.6355 4.3535 5.8557 5.0094 4.5062 7.8821 7.6449 2.7780 2.8754 5.3909 3.5172 1.8557 4.0843 4.0700 5.4440 1.1521 6.3382 6.3047 4.8564 1.4625 2.2964 2.6087 2.0317 3.7584 1.9257 2.8088 4.9823 3.4071 1.2687 1.4337 2.8861 1.6123 1.5427 3.8984 1.3992 2.0485 1.3923 4.2929 5.6797 1.4553 1.3171 2.2505 2.2452 1.6331 2.1164 1.6226 3.8632 1.1801 1.1058 1.7523 1.2750 1.6862 1.1228 2.0583 1.0873 1.6680 1.5646 2.1721 1.5008 1.2605 1.4648 6.9451 7.1418 2.1293 2.1829 1.1057 2.0161 2.2171 2.2068 6.2692 6.1896 5.9430 5.9746 6.2752 9.2428 1.0615 1.0830 1.0988 1.0875 1.0871 1.0865 1.0867 1.0922 1.0926 1.0953 1.0972 1.1013 1.0979 1.0644 1.0785
irintensity: 0.1175 0.4569 0.8723 8.1709 0.7024 0.2528 0.0918 2.7516 4.3206 0.6971 7.3069 4.5901 0.8490 0.4543 1.6466 6.6235 0.2196 0.1347 4.3255 7.3704 48.2107 39.4021 49.8935 14.7327 24.9821 0.3131 0.1656 12.7220 189.9515 28.8972 40.4472 45.0659 33.6394 34.7764 14.5210 17.0188 8.4612 0.0461 0.9705 0.8760 3.0046 4.6629 22.1682 0.0558 0.9444 0.6027 0.2908 0.3721 0.0604 1.5954 10.4288 13.3333 3.1834 236.7957 1.9952 18.7616 1.6172 0.5441 11.7620 0.8395 2.3600 0.7444 33.4364 0.4409 4.7904 0.6830 58.6321 7.9093 3.4142 12.7722 0.7412 0.8548 0.7276 16.4521 5.8096 424.3803 41.8383 40.2445 11.2097 6.5083 40.0508 48.3355 26.5411 283.7091 32.2909 18.6205 4.1728 9.9391 8.8488 1.4512 1.0511 19.7069 36.9860 12.6659 34.7931 31.9428 7.0036 33.1967 67.5694
temp: 298.150 k
press: 1.00000 atm
elementType: 8 8 8 7 6 6 6 6 6 6 6 6 6 6 6 6 6 6 6 6 1 1 1 1 1 1 1 1 1 1 1 1 1 1 1
symmnumber: 1
zpe: 718251.2 jmol-1
zpe.correction: 0.273567 hartree
zpe.thermalcorrener: 0.291628 hartree
zpe.thermalcorrenthalpy: 0.292572 hartree
zpe.thermalcorrgfe: 0.222493 hartree
zpe.sumelectzpe: -897.722484 hartree
zpe.sumelectthermal: -897.704423 hartree
zpe.sumelectthermalent: -897.703479 hartree
zpe.sumelectthermalfe: -897.773558 hartree
dipole: 0.3266 -0.1787 3.9062
dipole: 3.9239
quadrupole: -119.7197 -109.9228 -108.4676
quadrupole: 0.4037 13.4785 1.9812
quadrupole: -7.0163 2.7805 4.2358 0.4037 13.4785 1.9812
hfenergy: -897.996051 hartree
pointgroup: C01 [X(C16H15N1O3)]
dipole: -0.0566442 0.2146221 1.5277532 debye
polarizability: 180.2666331|-3.7508144|187.1874942|-1.2989462|-11.679577|177.5802753 unknown
InChI: InChI=1S/C16H15NO3/c18-14(19)11-17-16(20)15(12-7-3-1-4-8-12)13-9-5-2-6-10-13/h1-10,15,17-18H,11H2
charge 0 multiplicity 1
35 atoms
O  -0.863475 -0.723528 -1.657344
O  -3.794219 -1.900486 2.014714
O  -5.125015 -2.887493 0.381218
N  -1.952491 -1.033494 0.355162
C  0.206317 0.167261 0.404102
C  0.291866 1.662562 0.042732
C  1.551139 -0.562997 0.237982
C  -0.8979 -0.557983 -0.398022
C  0.601899 2.589673 1.070921
C  2.150931 -1.187568 1.359603
C  0.110748 2.143474 -1.279231
C  2.207007 -0.628974 -1.017489
C  0.732326 3.967492 0.789423
C  3.386256 -1.864083 1.235816
C  0.237217 3.522917 -1.559631
C  3.438458 -1.307629 -1.142693
C  -3.055614 -1.745348 -0.29038
C  0.550108 4.440189 -0.530658
C  4.034573 -1.925899 -0.01812
C  -4.101622 -2.246563 0.68697
H  -0.057546 0.107882 1.477938
H  0.751879 2.229561 2.096826
H  1.652477 -1.14398 2.336699
H  -0.144723 1.438737 -2.077401
H  1.745998 -0.162529 -1.892991
H  -1.996616 -0.90656 1.367757
H  0.973761 4.668613 1.596436
H  3.838881 -2.339556 2.113395
H  0.09097 3.880744 -2.585217
H  3.934494 -1.35428 -2.11878
H  -2.677657 -2.610706 -0.868909
H  -3.563543 -1.100519 -1.034617
H  0.64894 5.508687 -0.752747
H  4.992077 -2.449289 -0.118521
H  -4.501699 -2.241129 2.625058
