program: Gaussian 09
title: 000101310
version: EM64L-G09RevD.01
frameworkgroup: C1[X(C11H17NO2S)]
method: RPBEPBE
basis: SDD
operation: Freq
keyword: #p
keyword: freq=noraman
keyword: PBEPBE/SDD
title: #p freq=noraman PBEPBE/SDD
converged: YES YES NO NO
title: Mulliken charges:
elementType: S O O N C C C C C C C C C C C H H H H H H H H H H H H H H H H H
charge: 0.987701 -0.535107 -0.534843 -0.519218 -0.019879 -0.367229 -0.712757 -0.697705 -0.081015 -0.256375 -0.227863 0.449249 -0.361644 -0.375181 -0.798384 0.233561 0.259821 0.199858 0.300865 0.201940 0.223897 0.224055 0.203124 0.221614 0.219485 0.286063 0.283184 0.244233 0.243996 0.241197 0.231765 0.231594
chargesum: 0.00000
title: Mulliken charges with hydrogens summed into heavy atoms:
elementType: S O O N C C C C C C C C C C C
charge: 0.987701 -0.535107 -0.534843 -0.218353 0.213681 0.092450 -0.062866 -0.053482 -0.081015 0.029688 0.055322 0.449249 -0.117412 -0.131185 -0.093829
polarizability: 2.01194005e+02 -1.61445269e+01 1.43030910e+02 -9.86129647e+00 -1.34330192e+01 1.39076358e+02
1716.lowfreq: -29.8580 -4.7929 0.0012 0.0017 0.0018 5.8638 10.2250 24.3564 38.5703
frequency: -29.4520 24.0661 38.4872 44.8088 75.7633 90.9541 132.6289 141.0793 148.4207 204.5911 213.3921 225.7921 251.0334 253.6754 283.6452 301.8001 341.8921 365.3244 381.3689 402.0295 406.8538 427.4057 442.5679 486.3432 508.1428 580.1918 621.7179 704.6776 717.9545 776.1663 812.3928 819.9379 827.3646 850.6648 900.5127 918.5483 941.7827 954.6837 962.3344 975.2820 982.0403 990.5786 994.3648 1044.8208 1049.1884 1049.6335 1117.3685 1134.5488 1137.8711 1178.0955 1183.5540 1217.5898 1233.3370 1290.1343 1294.7894 1328.3998 1344.6747 1365.6923 1378.6185 1379.3088 1389.8891 1395.1452 1400.0403 1463.3859 1470.6973 1470.9761 1472.5107 1473.4825 1475.2968 1481.3739 1493.9820 1592.8958 1594.7317 2915.6812 2967.7528 2972.1824 2980.0789 3008.6112 3042.9100 3060.5176 3062.5420 3070.9931 3073.0026 3077.7585 3092.1562 3133.6173 3135.0050 3156.9874 3161.7681 3433.2786
redmass: 1.0122 4.2470 2.6559 3.5022 4.1560 4.4308 4.0774 3.6798 3.7624 1.0903 2.9176 5.6217 1.2806 3.8558 5.2024 4.1750 2.9667 2.7018 3.8862 2.8244 2.8775 3.0427 8.4418 2.7799 2.9494 5.9877 6.9565 2.7886 2.1411 4.7549 4.8199 2.6865 1.4906 1.2419 1.4744 1.1855 2.8239 1.5782 1.3028 2.3454 1.4107 1.5009 5.4866 4.2703 1.7703 2.2289 1.2903 1.6472 2.2224 1.8475 1.1566 2.9638 1.2915 1.3108 1.2685 1.3344 1.2949 1.2583 1.4175 3.4139 3.0197 1.2167 1.2211 1.0571 1.2140 1.9485 1.0459 1.0566 1.0774 1.0573 1.0464 6.8779 6.0075 1.0664 1.0366 1.0362 1.0391 1.0839 1.0938 1.0989 1.0947 1.0983 1.0997 1.0987 1.1001 1.0888 1.0891 1.0958 1.0964 1.0759
irintensity: 0.4488 0.8576 0.0821 0.2694 4.1871 1.0304 0.6857 6.0393 1.2086 0.1738 6.6345 2.6929 0.2095 2.3549 2.7156 1.3030 29.1199 4.0908 29.9287 3.9976 0.0530 20.2704 100.7168 19.4727 93.3986 30.7122 0.1881 4.7965 22.2366 5.9320 91.2072 57.9254 13.4224 0.4583 9.3517 4.7880 31.2316 15.2884 1.7594 13.5937 0.6718 5.9321 3.1900 34.9497 30.0878 9.3043 8.6234 0.7857 5.2313 31.7604 5.0588 5.5268 38.5394 0.2147 2.9613 1.0913 1.9689 4.6820 17.2958 3.6067 10.0560 14.6000 15.6533 2.8621 18.7186 22.2242 9.5575 14.4203 5.0413 7.6481 29.3356 0.2396 7.5820 43.6321 29.6363 28.9770 24.9256 6.4978 2.3398 12.6291 20.0674 78.1274 18.6896 69.9705 14.3099 13.6797 6.4302 4.1861 8.6127 16.8419
temp: 298.150 k
press: 1.00000 atm
elementType: 16 8 8 7 6 6 6 6 6 6 6 6 6 6 6 1 1 1 1 1 1 1 1 1 1 1 1 1 1 1 1 1
symmnumber: 1
zpe: 680496.5 jmol-1
zpe.correction: 0.259187 hartree
zpe.thermalcorrener: 0.275891 hartree
zpe.thermalcorrenthalpy: 0.276835 hartree
zpe.thermalcorrgfe: 0.213675 hartree
zpe.sumelectzpe: -1031.293867 hartree
zpe.sumelectthermal: -1031.277163 hartree
zpe.sumelectthermalent: -1031.276219 hartree
zpe.sumelectthermalfe: -1031.339379 hartree
dipole: 2.5154 -6.7313 -2.0929
dipole: 7.4845
quadrupole: -81.9626 -112.9249 -98.1522
quadrupole: -0.0676 -0.2569 -4.6326
quadrupole: 15.7173 -15.2450 -0.4723 -0.0676 -0.2569 -4.6326
hfenergy: -1031.553054 hartree
pointgroup: C01 [X(C11H17N1O2S1)]
dipole: 0.9896811 2.6501847 0.8172504 debye
polarizability: 201.1263095|16.1608742|142.8322696|10.1753387|-13.3625856|139.3426943 unknown
InChI: InChI=1S/C11H17NO2S/c1-9(2)8-12-15(13,14)11-6-4-10(3)5-7-11/h4-7,9,12H,8H2,1-3H3
charge 0 multiplicity 1
32 atoms
S  -0.480504 -1.642614 -0.267572
O  -0.815348 -1.743758 -1.854817
O  -0.294294 -2.926896 0.709527
N  -1.894002 -0.714081 0.453884
C  -3.791295 0.841974 0.060207
C  -2.309519 0.512085 -0.2621
C  -4.011758 1.089467 1.570426
C  -4.234609 2.0652 -0.775695
C  1.090624 -0.587399 -0.10641
C  1.879795 -0.740477 1.045632
C  1.419087 0.285953 -1.155764
C  3.416255 0.960208 0.12876
C  3.048905 0.044651 1.151539
C  2.592588 1.06137 -1.024184
C  4.661121 1.816886 0.269511
H  -4.387636 -0.040256 -0.242893
H  -2.216762 0.298709 -1.343204
H  -1.670673 1.393166 -0.021546
H  -1.726666 -0.624616 1.468779
H  -3.370344 1.91655 1.934422
H  -5.062241 1.369222 1.769305
H  -3.795109 0.185261 2.168636
H  -3.653373 2.966745 -0.500772
H  -5.302544 2.288597 -0.599889
H  -4.099027 1.886966 -1.858623
H  1.606646 -1.474823 1.810858
H  0.797673 0.328789 -2.056251
H  3.688862 -0.062897 2.03496
H  2.876905 1.745424 -1.832097
H  4.425656 2.773066 0.775886
H  5.436287 1.310543 0.87036
H  5.096502 2.065182 -0.713775
