program: Gaussian 09
title: 000101302
version: EM64L-G09RevD.01
frameworkgroup: C1[X(C9H12ClNO2S)]
method: RPBEPBE
basis: SDD
operation: Freq
keyword: #p
keyword: freq=noraman
keyword: PBEPBE/SDD
title: #p freq=noraman PBEPBE/SDD
converged: YES YES NO NO
title: Mulliken charges:
elementType: Cl S O O N C C C C C C C C C H H H H H H H H H H H H
charge: -0.028678 0.999579 -0.530511 -0.531589 -0.527013 -0.334497 -0.350880 -0.077333 -0.659660 -0.238006 -0.212420 -0.183423 -0.195036 -0.100586 0.250124 0.217803 0.196087 0.208411 0.304331 0.247451 0.212198 0.211593 0.292667 0.290552 0.269620 0.269216
chargesum: 0.00000
title: Mulliken charges with hydrogens summed into heavy atoms:
elementType: Cl S O O N C C C C C C C C C
charge: -0.028678 0.999579 -0.530511 -0.531589 -0.222682 0.133429 0.053618 -0.077333 0.011581 0.054661 0.078132 0.086198 0.074180 -0.100586
polarizability: 2.08430261e+02 -9.74917040e+00 1.20269899e+02 -6.02481952e+00 -1.60078266e+01 1.16182473e+02
1716.lowfreq: -8.0597 -3.4803 0.0013 0.0019 0.0021 4.3146 18.1286 32.2777 41.8293
frequency: 17.9154 32.2605 41.8050 66.7577 105.0220 120.6511 136.5412 159.1756 206.8408 225.2548 248.3614 264.4892 279.9663 315.8531 326.3141 368.7649 394.6631 408.8688 425.0173 464.0100 488.1505 504.4827 611.4835 694.5583 698.1115 714.9256 771.5596 813.8716 831.4431 832.3643 866.2487 908.8191 957.5379 958.8463 971.5467 976.5233 983.1902 1043.8291 1065.5437 1080.8690 1100.1304 1102.4162 1133.1358 1172.5898 1221.7721 1265.5130 1279.3524 1324.1694 1342.6005 1361.9215 1377.0530 1380.3564 1393.4503 1447.1748 1465.8704 1470.2192 1483.1875 1489.1658 1566.1075 1592.4037 2929.6022 2977.0373 2987.8851 3026.1032 3049.9717 3080.4386 3099.3247 3153.8042 3155.9269 3176.9961 3179.5326 3445.2683
redmass: 4.8589 2.9974 3.3348 6.3504 3.5035 6.4895 4.8734 1.8974 7.9141 1.9296 7.1452 4.3791 3.6712 4.1120 2.4665 4.6282 13.6829 2.9111 6.5603 2.0046 7.5333 3.9973 7.1158 5.9592 3.2058 2.6527 1.2445 8.0586 1.2946 1.4009 2.6793 1.3614 1.3345 5.2771 1.4193 1.9917 6.8529 2.7257 3.0859 3.0076 1.5933 1.4910 1.8163 1.1282 1.2780 1.1781 1.2326 1.2649 1.3211 1.2497 3.0487 9.7562 1.2197 2.1380 1.0717 1.0504 1.0713 1.0552 6.1654 8.2487 1.0665 1.0601 1.0378 1.0991 1.0949 1.0999 1.0998 1.0898 1.0897 1.0960 1.0972 1.0764
irintensity: 0.3640 0.3016 1.1782 3.8612 2.6782 1.4219 6.5180 1.6903 1.0085 1.3219 2.2131 6.6145 1.8600 1.5322 43.9054 22.8582 81.2507 0.1654 42.4374 28.7254 31.5667 98.4477 0.2972 28.8445 9.8425 29.7283 9.1181 141.9820 7.2354 30.3048 1.9379 9.9483 0.3622 64.6709 1.5674 29.1567 31.2079 30.4722 55.8346 3.5755 3.7170 6.7508 27.4673 4.7925 8.0051 6.1659 2.1521 1.9033 10.8695 2.8896 17.6338 0.1812 21.6739 54.0912 4.9981 10.1582 23.4840 11.1920 26.7704 2.1345 44.6645 49.0408 29.4332 21.2476 12.6576 47.4235 30.1306 2.3516 1.7188 0.2323 3.5933 20.6431
temp: 298.150 k
press: 1.00000 atm
elementType: 17 16 8 8 7 6 6 6 6 6 6 6 6 6 1 1 1 1 1 1 1 1 1 1 1 1
symmnumber: 1
zpe: 512079.0 jmol-1
zpe.correction: 0.195041 hartree
zpe.thermalcorrener: 0.210643 hartree
zpe.thermalcorrenthalpy: 0.211587 hartree
zpe.thermalcorrgfe: 0.149657 hartree
zpe.sumelectzpe: -1412.226598 hartree
zpe.sumelectthermal: -1412.210996 hartree
zpe.sumelectthermalent: -1412.210052 hartree
zpe.sumelectthermalfe: -1412.271982 hartree
dipole: 1.4940 -4.6465 -2.3713
dipole: 5.4264
quadrupole: -102.8416 -106.1824 -95.6894
quadrupole: 12.1864 4.1454 -5.2897
quadrupole: -1.2705 -4.6112 5.8817 12.1864 4.1454 -5.2897
hfenergy: -1412.4216387 hartree
pointgroup: C01 [X(C9H12Cl1N1O2S1)]
dipole: 0.5167852 -1.8632739 -0.9049623 debye
dipolederiv: -0.8203943 0.2430794 0.0523376 0.2901005 -0.1638672 0.0042036 0.0657296 0.0023056 -0.0930286 2.0573153 -0.0365661 0.0427507 0.0786679 1.5420293 0.1875473 0.2349884 0.2673163 1.2221714 -0.7200203 0.0257292 0.0460276 0.0083189 -0.4962548 0.0272071 0.0508839 -0.0986141 -0.6167013 -0.7016872 0.0206407 -0.0103898 -0.0078047 -0.6999066 -0.0024231 -0.0172318 0.1570159 -0.4935029 -0.6971265 0.0478248 -0.061393 -0.0584935 -0.7142527 -0.0590775 -0.1974584 -0.062062 -0.3646739 0.0565829 -0.1295669 -0.0814447 0.1440935 0.4888052 0.0250537 -0.3256904 -0.2747024 0.0235607 0.1857126 0.0602335 0.0072483 -0.0913971 0.0136403 -0.0498316 0.1040712 0.0464656 0.1990835 -0.1349424 -0.0207145 -0.0005655 -0.093322 -0.2721491 -0.0490329 -0.0752118 -0.0853676 -0.1880989 -0.0730182 0.0374111 0.0243955 0.0120634 -0.0069101 -0.0073117 0.0040557 -0.0284101 0.0553903 -0.1468721 -0.0771491 0.0458604 0.1577494 -0.0516652 -0.0874615 -0.2097859 0.0377943 -0.0364745 -0.1667472 0.0404998 -0.0955397 -0.1085043 -0.0386433 0.0330442 0.1866169 -0.0944047 -0.0271606 -0.2968981 0.1518187 -0.0978771 0.1199825 -0.1180733 -0.0091023 -0.0197249 -0.0232206 -0.0124602 -0.3561333 0.0261172 0.1081559 0.0935044 -0.0511117 -0.0752192 0.0631336 -0.0527949 -0.0320839 1.2216012 -0.4323558 -0.1131267 -0.4725367 0.173042 -0.0579728 -0.1350667 -0.057735 0.0954463 0.1361415 0.0331536 -0.0064092 0.0064527 0.0685444 -0.0474462 0.015237 0.0258034 -0.0474226 -0.12633 0.1322964 0.029815 0.0263039 -0.1407746 -0.0196638 0.0796287 -0.0050192 0.061843 0.0216802 0.0048492 0.049547 0.0349693 0.0877573 0.0120574 0.0124497 -0.0431557 -0.187194 -0.0368447 -0.0392859 -0.0185153 -0.0368114 -0.1831281 0.0396598 -0.0044543 0.0754534 0.0673099 0.2238517 -0.1153247 0.0529321 -0.1386215 0.0735583 -0.0623035 0.1145673 0.0124366 0.0900724 0.1645003 -0.0034041 0.0265384 0.0257152 -0.0995877 0.045918 0.0124915 0.0573358 0.0688265 -0.1774172 -0.0809261 -0.070688 -0.0982356 0.0579103 -0.0482506 -0.0970869 -0.0477346 0.0617691 0.0856589 0.0210323 -0.0147508 0.022807 0.084724 0.0091581 0.0554107 0.0067333 -0.1601577 0.1291164 0.0480713 -0.0349681 0.0143066 0.1021822 0.057193 -0.0136514 0.0287614 0.1018864 0.0992337 -0.0164479 0.0696913 -0.0100426 0.1255368 0.0103053 0.0401841 0.0338002 0.0889523 0.0222309 0.0041067 0.0708768 0.0166063 0.1267738 0.0470475 0.0672485 0.0500524 0.0572975 0.050806 0.054877 -0.0205085 0.064128 0.0918205 0.0767017 -0.0113345 0.0719468 0.0653496 unknown
polarizability: 207.5311373|-12.9048998|120.4022487|-7.4585628|-15.7201439|116.9492475 unknown
InChI: InChI=1S/C9H12ClNO2S/c1-2-7-11-14(12,13)9-5-3-8(10)4-6-9/h3-6,11H,2,7H2,1H3
charge 0 multiplicity 1
26 atoms
Cl 5.027937 -1.114779 -0.222352
S  -0.998622 1.212789 0.247529
O  -1.411628 1.096848 1.813996
O  -1.035295 2.587725 -0.616479
N  -2.13178 0.085898 -0.62714
C  -2.330523 -1.266119 -0.062522
C  -3.670598 -1.845147 -0.577928
C  0.772608 0.528834 0.111676
C  -4.899977 -1.052537 -0.091649
C  1.564227 0.948737 -0.970853
C  1.225867 -0.34941 1.110427
C  2.878804 0.440507 -1.072615
C  2.540636 -0.857633 1.005389
C  3.338137 -0.459523 -0.087817
H  -2.378827 -1.152401 1.036153
H  -1.495899 -1.959811 -0.308307
H  -3.653464 -1.880742 -1.686128
H  -3.729579 -2.896803 -0.232883
H  -1.962131 0.158784 -1.642031
H  -4.821603 0.006595 -0.389782
H  -5.831865 -1.469611 -0.514345
H  -4.98012 -1.085377 1.010606
H  1.178406 1.674905 -1.693861
H  0.584723 -0.603627 1.960589
H  3.532532 0.744477 -1.894712
H  2.936833 -1.540078 1.762242
