program: Gaussian 09
title: 000101409
version: EM64L-G09RevD.01
frameworkgroup: C1[X(C21H24O6)]
method: RPBEPBE
basis: SDD
operation: Freq
keyword: #pfreq=noraman
keyword: PBEPBE/SDD
title: #p freq=noraman PBEPBE/SDD
converged: YES YES NO NO
title: Mulliken charges:
elementType: O O O O O O C C C C C C C C C C C C C C C C C C C C C H H H H H H H H H H H H H H H H H H H H H H H H
charge: -0.433538 -0.438359 -0.480523 -0.481412 -0.432987 -0.487006 0.253021 -0.628837 -0.629986 0.167727 0.163210 0.136124 0.137373 0.462109 0.474692 -0.763798 -0.739852 -0.766238 -0.737777 0.090346 0.021538 -0.658322 -0.664027 -0.242543 -0.064637 0.259891 0.207394 0.244078 0.208291 0.238316 0.210128 0.212382 0.236509 0.209335 0.211995 0.218355 0.225931 0.214471 0.202741 0.234951 0.211606 0.230173 0.211151 0.265736 0.235491 0.366176 0.382893 0.373508 0.395411 0.365492 0.371297
chargesum: 0.00000
title: Mulliken charges with hydrogens summed into heavy atoms:
elementType: O O O O O O C C C C C C C C C C C C C C C C C C C C C
charge: -0.067361 -0.055465 -0.107015 -0.086001 -0.067495 -0.115709 0.253021 -0.176469 -0.181542 0.167727 0.163210 0.136124 0.137373 0.462109 0.474692 -0.105572 -0.083571 -0.114076 -0.084846 0.090346 0.021538 -0.392587 -0.428536 -0.242543 -0.064637 0.259891 0.207394
polarizability: 2.99433461e+02 -6.30771565e-01 2.37788337e+02 -1.96022036e+01 7.78176974e-01 2.08763904e+02
1716.lowfreq: -7.8612 -0.0008 -0.0006 -0.0006 1.3741 7.4766 31.3910 33.9402 41.5059
frequency: 31.3405 33.9316 41.5009 64.2504 70.2056 101.7186 129.6220 146.2045 154.7298 158.8324 163.6776 205.9925 214.9857 221.4135 229.6273 231.8526 232.6288 247.3796 253.3011 261.4416 263.3591 266.3814 269.3091 274.7737 281.1934 287.3205 298.9604 302.6556 305.4637 319.4620 339.0208 384.4154 399.5773 404.2516 411.4284 432.6617 464.6463 470.2262 482.2817 485.7991 502.5212 510.5246 537.4037 561.5069 563.8614 568.9478 589.9606 598.3671 601.1104 632.8552 643.6387 645.9969 658.9953 668.8873 746.4647 756.7702 783.8280 796.1876 802.9701 809.5249 847.2913 855.9802 868.2480 881.9497 925.3808 926.7017 932.2813 935.8427 956.2849 980.8954 988.0355 995.0311 1003.0911 1013.1367 1034.4777 1043.9067 1044.9728 1113.2269 1120.6944 1137.0172 1140.9472 1156.8200 1171.1468 1172.9672 1195.6813 1199.5179 1209.6829 1216.6562 1223.6190 1233.3116 1235.1755 1252.6118 1264.6181 1266.7426 1271.7098 1310.1458 1322.0342 1347.4808 1368.7640 1372.8827 1375.3446 1392.3833 1394.0458 1399.4874 1420.8071 1449.4756 1455.6462 1459.6895 1463.3922 1465.4630 1467.8676 1473.3496 1478.9838 1479.4044 1479.7660 1483.3420 1485.7322 1488.4084 1498.0480 1603.5300 1631.1947 1633.6638 1637.9765 2966.4875 2968.2820 2969.8630 2972.2174 3005.2810 3007.5068 3055.0071 3059.2094 3062.6346 3064.6270 3066.3163 3067.7469 3073.3323 3076.1819 3078.3863 3080.2095 3118.5893 3161.6532 3500.2083 3506.1597 3508.1924 3516.2291 3567.4850 3627.4771
redmass: 4.3845 6.9089 5.9279 3.3481 4.6016 3.4421 4.8207 5.2295 3.0983 7.3953 6.8695 2.3842 2.3857 2.1949 1.1423 1.0843 1.0943 3.3474 3.3297 3.8248 1.3075 1.4558 2.7920 4.5922 3.0852 2.8596 3.1649 3.1440 3.4229 3.5960 2.8117 2.1807 1.1219 3.4029 3.4753 4.4834 4.8460 4.0639 2.1105 1.5208 1.5782 2.3918 5.2940 2.9422 4.2748 1.2512 3.5617 4.6504 3.9285 4.7459 4.3226 5.4888 5.4388 6.2838 4.1097 4.4581 6.2311 4.3347 5.0207 1.7486 3.5785 1.6542 2.7211 2.0109 1.9247 2.0158 1.6911 1.5707 2.6260 2.8485 2.4171 1.6148 1.6537 2.2344 2.5285 2.7721 2.6426 1.6964 1.3886 2.1915 1.7418 1.3147 2.6457 2.7331 1.6022 1.9628 2.3419 2.3851 2.8932 1.8049 1.9394 1.8880 2.1361 1.7748 1.8461 1.4271 1.7057 4.5725 2.4151 1.2078 1.3855 1.2376 1.3659 5.1865 6.7775 4.5800 1.1099 1.0769 1.0508 1.0606 1.0944 1.1345 1.0620 1.2368 2.1278 1.2264 1.2442 2.4623 3.4895 9.0319 8.2374 7.6400 7.4049 1.0349 1.0346 1.0353 1.0354 1.0594 1.0598 1.0999 1.1005 1.1004 1.1020 1.1000 1.1020 1.1000 1.1004 1.0996 1.0998 1.0912 1.0919 1.0646 1.0653 1.0659 1.0649 1.0653 1.0665
irintensity: 0.0800 0.6129 0.9288 0.4198 0.9244 2.0504 2.1610 0.2492 0.5055 0.4498 1.4919 23.9680 5.8520 61.5972 71.4254 0.2264 71.4571 0.9205 12.0571 3.9396 0.0830 0.9220 2.3791 2.9267 2.3494 0.9338 1.3499 8.7980 5.0766 6.0196 2.4037 3.2482 167.0872 0.9629 3.2405 12.5274 10.0691 5.6480 30.4025 135.1473 103.6551 46.3591 7.0346 5.6097 2.1295 21.0635 4.4858 0.7606 8.2705 5.6381 9.5210 15.9964 3.6438 3.2468 5.2546 4.6318 53.3865 2.7216 28.1049 27.8516 30.4573 32.8251 31.2935 2.5977 0.1413 0.6274 2.7100 2.6381 38.3833 44.4833 70.2274 9.3417 41.6225 3.0437 68.4108 104.2412 11.7745 164.3291 10.7653 40.4456 1.8177 95.1735 12.7359 6.7250 23.8565 25.2645 50.6568 38.0889 62.8961 72.9300 48.2072 163.8802 4.1503 186.0809 74.9947 13.6937 19.7363 67.8958 19.8030 18.0101 27.1230 11.5808 3.1776 48.7584 14.8273 57.8901 2.1023 3.7566 2.5008 6.1472 9.2529 2.0701 10.4303 0.5223 23.9281 0.7386 8.2149 66.3001 73.1597 105.2250 42.7215 19.5695 34.7771 25.9116 25.6635 52.9127 43.7663 34.4705 28.7240 9.7110 6.7607 52.4757 18.7221 57.4461 27.9653 47.5030 16.4291 50.4287 46.9420 15.7893 4.2844 29.0964 70.6354 15.4527 64.6253 97.6455 59.2593
temp: 298.150 k
press: 1.00000 atm
elementType: 8 8 8 8 8 8 6 6 6 6 6 6 6 6 6 6 6 6 6 6 6 6 6 6 6 6 6 1 1 1 1 1 1 1 1 1 1 1 1 1 1 1 1 1 1 1 1 1 1 1 1
symmnumber: 1
zpe: 1064983.8 jmol-1
zpe.correction: 0.405631 hartree
zpe.thermalcorrener: 0.432524 hartree
zpe.thermalcorrenthalpy: 0.433468 hartree
zpe.thermalcorrgfe: 0.351540 hartree
zpe.sumelectzpe: -1263.981142 hartree
zpe.sumelectthermal: -1263.954249 hartree
zpe.sumelectthermalent: -1263.953305 hartree
zpe.sumelectthermalfe: -1264.035233 hartree
dipole: -2.6937 -0.1186 2.9477
dipole: 3.9949
quadrupole: -143.6817 -151.5726 -149.1413
quadrupole: 0.7008 4.6953 -6.0942
quadrupole: 4.4501 -3.4407 -1.0094 0.7008 4.6953 -6.0942
hfenergy: -1264.3867732 hartree
pointgroup: C01 [X(C21H24O6)]
dipole: -1.0647611 0.0612815 -1.1544708 debye
polarizability: 299.5942063|0.4872047|237.761127|19.2263853|1.2455728|208.6303689 unknown
InChI: InChI=1S/C21H24O6/c1-19(2)7-21(13-9(19)5-11(22)15(24)17(13)26)8-20(3,4)10-6-12(23)16(25)18(27)14(10)21/h5-6,22-27H,7-8H2,1-4H3
charge 0 multiplicity 1
51 atoms
O  0.489697 1.44613 -1.885304
O  -0.360036 1.40611 1.938448
O  3.015114 2.689775 -2.00239
O  -2.801318 2.639238 2.119323
O  5.108563 1.75948 -0.353581
O  -4.956058 1.828047 0.635586
C  0.044293 -0.94564 -0.001291
C  0.429786 -1.806824 1.264451
C  -0.35639 -1.776456 -1.281431
C  1.994266 -1.844906 1.378603
C  -1.922447 -1.804842 -1.381798
C  1.324951 -0.142923 -0.220042
C  -1.225149 -0.130176 0.236739
C  2.405812 -0.613894 0.561764
C  -2.316079 -0.587637 -0.535897
C  2.451088 -1.76048 2.855697
C  2.584339 -3.128898 0.724256
C  -2.389428 -1.68683 -2.85406
C  -2.511563 -3.102294 -0.754267
C  1.529634 0.951175 -1.082703
C  -1.40792 0.942705 1.132243
C  3.677408 -0.00526 0.532249
C  -3.591386 0.012366 -0.449414
C  2.814359 1.537999 -1.157294
C  -2.676927 1.558133 1.220051
C  3.867883 1.103175 -0.318461
C  -3.75396 1.100967 0.432921
H  0.022967 -1.307293 2.161819
H  -0.003963 -2.82165 1.213798
H  0.04404 -1.258461 -2.171667
H  0.073626 -2.793966 -1.25802
H  2.055747 -2.618386 3.431787
H  2.086258 -0.829388 3.32501
H  3.553993 -1.780741 2.940136
H  2.260557 -4.028641 1.281254
H  3.6899 -3.10089 0.729973
H  2.254439 -3.232168 -0.325305
H  -2.003268 -2.534527 -3.451267
H  -3.493502 -1.700789 -2.932261
H  -2.023008 -0.747854 -3.306421
H  -2.193846 -3.990891 -1.33246
H  -2.176548 -3.229165 0.290764
H  -3.617464 -3.072667 -0.752737
H  4.504889 -0.342605 1.162377
H  -4.431542 -0.348523 -1.055105
H  0.775014 2.325151 -2.2532
H  -0.687748 2.18072 2.468283
H  3.329945 2.396444 -2.897437
H  -3.7282 2.98748 2.080989
H  4.99725 2.606545 -0.862189
H  -5.677765 1.500823 0.048383
