program: Gaussian 09
title: 000101258
version: EM64L-G09RevD.01
frameworkgroup: C1[X(C2H4Cl2O2S)]
method: RPBEPBE
basis: SDD
operation: Freq
keyword: #p
keyword: freq=noraman
keyword: PBEPBE/SDD
title: #p freq=noraman PBEPBE/SDD
converged: YES YES NO NO
title: Mulliken charges:
elementType: Cl Cl S O O C C H H H H
charge: 0.092071 0.092082 0.996024 -0.527841 -0.527767 -0.629404 -0.735425 0.381189 0.298312 0.280326 0.280433
chargesum: 0.00000
title: Mulliken charges with hydrogens summed into heavy atoms:
elementType: Cl Cl S O O C C
charge: 0.092071 0.092082 0.996024 -0.527841 -0.527767 -0.248215 0.123646
polarizability: 7.94453790e+01 -7.43156241e-03 8.38469478e+01 1.55791187e+00 -8.74693573e-03 5.88004157e+01
1716.lowfreq: -8.0223 -0.0010 -0.0007 0.0014 8.9285 15.2034 36.7353 117.1646 133.9559
frequency: 36.7154 117.1645 133.9546 136.8702 184.7593 209.1331 281.9389 284.9527 293.6903 364.3480 476.6004 598.5840 648.8372 716.5113 807.7521 900.9685 969.2203 1021.9063 1091.1395 1163.4457 1300.0791 1412.4751 1419.8488 3035.0309 3128.1593 3183.0467 3190.8001
redmass: 7.9043 1.8919 2.0517 4.0180 17.5368 5.5401 13.2249 7.2645 8.0583 9.2653 6.1424 9.7101 8.6916 9.4620 11.5867 2.8115 1.2879 1.9944 1.1218 1.0757 1.1321 1.0526 1.0532 1.0244 1.0893 1.1072 1.1082
irintensity: 3.3644 0.5250 1.2413 8.3033 4.3763 0.0677 10.9940 1.2634 30.6989 36.5370 2.7072 25.7230 48.2504 116.7127 61.9704 29.7530 35.9413 52.0665 6.9091 8.1727 5.8317 14.1780 17.3734 0.3493 0.7091 0.2578 0.0261
temp: 298.150 k
press: 1.00000 atm
elementType: 17 17 16 8 8 6 6 1 1 1 1
symmnumber: 1
zpe: 162141.4 jmol-1
zpe.correction: 0.061756 hartree
zpe.thermalcorrener: 0.071200 hartree
zpe.thermalcorrenthalpy: 0.072144 hartree
zpe.thermalcorrgfe: 0.025808 hartree
zpe.sumelectzpe: -1546.483991 hartree
zpe.sumelectthermal: -1546.474548 hartree
zpe.sumelectthermalent: -1546.473603 hartree
zpe.sumelectthermalfe: -1546.519939 hartree
dipole: 2.2247 0.0056 3.1029
dipole: 3.8180
quadrupole: -68.8805 -70.4471 -57.3143
quadrupole: -0.0151 -8.4117 0.0168
quadrupole: -3.3332 -4.8998 8.2330 -0.0151 -8.4117 0.0168
hfenergy: -1546.5457475 hartree
pointgroup: C01 [X(C2H4Cl2O2S1)]
dipole: 0.4127128 -1.4429328 -0.0627577 debye
dipolederiv: -0.2378359 0.082738 -0.1180112 0.1612886 -0.1998316 0.3014695 -0.2519602 0.2039703 -0.5721971 -0.3680452 0.0994014 0.2035036 0.1785737 -0.1322217 -0.1894421 0.3504826 -0.1135514 -0.5103514 1.3434607 -0.1496929 0.0298569 0.0638162 1.2638096 0.0277061 0.047777 -0.0017591 1.0457522 -0.6394364 0.0630672 0.0429188 0.0125958 -0.5391453 -0.0290125 0.1468903 -0.139114 -0.5631476 -0.5850433 0.0302851 -0.0457735 0.028414 -0.5689934 0.0381302 -0.1537277 0.1553726 -0.5876815 0.5362282 -0.1853537 -0.1040946 -0.3457179 0.2526851 -0.1249746 -0.1177623 -0.1028673 1.1421724 -0.1717329 0.0108744 -0.0087892 -0.0581222 -0.227844 -0.0186491 -0.0143356 -0.0088724 -0.1042878 -0.0710076 0.0479992 -0.0012597 0.0113662 0.0261173 0.0064866 -0.0044831 0.0115175 -0.0315407 0.0153956 0.0140565 -0.0146304 -0.0154405 0.0764911 -0.0062601 -0.0171962 -0.0022275 0.125468 0.0748189 -0.0069725 0.0583146 -0.0184414 0.0290924 -0.0316308 0.0566295 -0.0293405 0.0373493 0.103198 -0.0064027 -0.0420355 -0.0183324 0.0198405 0.0261769 -0.0423142 0.0268718 0.0184643 unknown
polarizability: 76.3020487|-7.5272247|62.4167556|-1.6841035|-2.8428868|83.3739381 unknown
InChI: InChI=1S/C2H4Cl2O2S/c1-7(5,6)2(3)4/h2H,1H3
charge 0 multiplicity 1
11 atoms
Cl 1.355436 -0.911698 2.090277
Cl 1.777624 -0.656997 -0.935061
S  -0.939538 0.346344 0.324816
O  -1.493161 0.936172 1.737749
O  -1.107553 1.168755 -1.070221
C  1.068314 0.081495 0.580954
C  -1.608449 -1.432467 0.084923
H  1.443216 1.105005 0.719369
H  -2.690012 -1.298752 -0.056118
H  -1.117382 -1.839251 -0.809027
H  -1.371895 -1.988407 1.001839
