program: Gaussian 09
title: 000149852
version: EM64L-G09RevD.01
frameworkgroup: C1[X(C10H7N3O3S)]
method: RPBEPBE
basis: SDD
operation: Freq
keyword: #p
keyword: freq=noraman
keyword: PBEPBE/SDD
title: #p freq=noraman PBEPBE/SDD
converged: YES YES NO NO
title: Mulliken charges:
elementType: S O O O N N N C C C C C C C C C C H H H H H H H
charge: 0.262689 -0.214154 -0.209284 -0.176341 0.010729 -0.307286 0.024442 0.373542 0.342632 -0.333853 -0.345134 0.384185 -0.376033 -0.368093 -0.682445 -0.216335 -0.048119 0.225752 0.302949 0.285906 0.288908 0.275300 0.328536 0.171505
chargesum: 0.00000
title: Mulliken charges with hydrogens summed into heavy atoms:
elementType: S O O O N N N C C C C C C C C C C
charge: 0.262689 -0.214154 -0.209284 -0.176341 0.010729 0.021251 0.024442 0.373542 0.342632 -0.108100 -0.042184 0.384185 -0.090127 -0.079185 -0.407144 -0.216335 0.123386
polarizability: 3.04134325e+02 1.13685654e+01 1.87560026e+02 3.82667490e-01 -3.91313061e-01 5.78598897e+01
1716.lowfreq: -0.0017 0.0005 0.0015 0.5194 3.0392 6.7218 26.4076 34.9503 51.0619
frequency: 26.1679 34.8632 51.0488 63.5024 71.8674 138.3158 144.3765 194.3678 231.9346 236.9103 281.9737 300.8648 332.7536 404.6038 412.5011 457.5323 478.7577 507.2109 539.6446 555.9339 559.7707 605.1210 626.7395 658.0600 672.9803 673.1026 733.4298 773.7275 775.4868 800.6079 842.5779 845.5883 888.7853 895.6403 945.8759 989.0199 997.4571 1003.1302 1017.9958 1045.0126 1094.6346 1111.8447 1164.9797 1183.1582 1204.8864 1221.6238 1295.4730 1311.1418 1359.0962 1385.5518 1398.3867 1421.8820 1457.8106 1471.6080 1518.9377 1585.0833 1592.6372 1612.2932 1666.1735 2934.6891 3149.3242 3165.9434 3183.8372 3187.5350 3244.7858 3529.8925
redmass: 7.5199 6.2705 9.2216 8.9709 6.1046 9.6611 6.5828 3.7674 10.3028 10.5761 11.1072 6.0425 3.6178 6.8968 2.9053 8.9017 3.7825 7.4989 8.5294 7.4976 5.9855 1.2260 7.1501 5.7719 4.1741 6.0259 2.0877 2.3516 8.9498 6.3822 8.3488 1.3713 1.5233 7.1764 1.6251 1.3563 5.8595 3.2302 1.3470 2.5703 3.1412 1.3500 2.0600 1.5225 1.9457 3.9952 1.7765 2.5026 8.3369 1.1732 8.5418 4.0560 2.9888 1.7521 4.9345 7.9776 7.5507 6.1282 5.8905 1.0876 1.0896 1.0902 1.0950 1.0965 1.0952 1.0779
irintensity: 5.4335 1.5055 0.1570 0.9110 0.0448 8.6017 20.4464 9.8230 0.4347 1.0913 1.2429 0.0097 1.9714 7.0764 0.0076 10.2634 9.1683 5.9016 0.6310 29.2040 23.6729 87.7990 0.0871 0.0258 17.6077 8.0414 36.5007 33.2298 66.6577 2.9327 0.4360 15.2955 45.7537 3.0292 0.2995 1.7454 14.1641 6.7230 0.0244 58.5464 24.4031 34.2605 92.3047 142.1394 40.3520 445.4820 10.5358 3.4762 93.0470 3.0788 20.1462 27.3755 9.1781 482.4060 1.1749 95.1032 86.8059 182.0281 181.6785 127.6329 8.3187 0.6809 1.1462 1.4835 4.5379 41.1374
temp: 298.150 k
press: 1.00000 atm
elementType: 16 8 8 8 7 7 7 6 6 6 6 6 6 6 6 6 6 1 1 1 1 1 1 1
symmnumber: 1
zpe: 420298.7 jmol-1
zpe.correction: 0.160083 hartree
zpe.thermalcorrener: 0.174829 hartree
zpe.thermalcorrenthalpy: 0.175773 hartree
zpe.thermalcorrgfe: 0.115502 hartree
zpe.sumelectzpe: -1171.966865 hartree
zpe.sumelectthermal: -1171.952119 hartree
zpe.sumelectthermalent: -1171.951175 hartree
zpe.sumelectthermalfe: -1172.011446 hartree
dipole: -9.0138 -4.2748 -0.1262
dipole: 9.9769
quadrupole: -107.7201 -105.9539 -106.6650
quadrupole: -3.1981 0.6726 -0.4041
quadrupole: -0.9404 0.8258 0.1146 -3.1981 0.6726 -0.4041
hfenergy: -1172.126948 hartree
pointgroup: C01 [X(C10H7N3O3S1)]
dipole: -3.4287788 1.9028707 0.1731784 debye
dipolederiv: -0.5703577 0.3283445 0.0189441 -0.1810524 -0.432849 -0.0388552 -0.0155594 -0.0344457 0.1130561 -1.0539199 -0.111346 -0.0129814 -0.2982128 -0.5287263 -0.0227256 -0.0256491 -0.0214364 -0.2373239 -0.7194546 0.204318 0.0114659 0.4255742 -0.8203116 -0.0389461 0.0272522 -0.0405637 -0.2343061 -0.2176922 0.5059115 0.0590696 -0.2978335 -0.9864667 -0.0741981 -0.0316152 -0.0852837 -0.3125441 -0.9254164 0.1076196 0.0010842 0.2549915 -0.3970674 -0.0110173 0.0195292 -0.0130905 -0.1555875 -0.9613033 -0.5320953 -0.05314 -1.0676723 -1.4657587 -0.1061734 -0.1005956 -0.1084582 -0.3457392 2.2924477 -0.2954772 -0.0078461 -0.3601487 1.1636971 0.0669131 -0.0134441 0.0673756 0.1956793 0.8245534 -0.154648 -0.0050753 -0.2618506 0.1423339 0.0044379 -0.0145879 0.0058012 0.0541986 0.1694322 0.0481309 0.001651 0.3832093 -0.0196649 -0.006305 0.025379 -0.0006993 0.0614941 -0.549112 -0.0202132 -0.0042503 -0.1398577 0.1060294 0.0167909 -0.011432 0.0169903 -0.141983 -0.3511674 0.2364207 0.0147293 0.4281735 -0.1781856 -0.0011023 0.0295216 -0.0021953 -0.1240792 -1.0870087 0.2925451 0.0134653 0.2851946 -0.0179505 -0.0031293 0.0134704 -0.0031313 0.0470362 0.267736 0.039402 0.0050576 -0.2893327 0.0046298 0.005611 -0.0183727 0.0076577 -0.1001721 0.3949159 -0.2445348 -0.014114 0.0974328 0.0073643 0.0084379 0.0092136 0.0069278 -0.101958 0.3912104 -0.3096174 -0.0194517 -0.2423668 -0.0519963 0.016903 -0.0148781 0.0164245 -0.3004509 1.1847632 0.4126115 0.0472839 0.5107455 1.1459534 0.0701962 0.0416879 0.0651451 0.0651282 0.6021898 -0.3275398 -0.0479454 0.8391604 1.9706868 0.191971 0.0694982 0.1966171 0.1965618 0.0824064 0.0784117 0.0053042 0.0541761 -0.0662295 -0.0141578 0.0037391 -0.0141824 0.1409243 0.103447 -0.058429 -0.0045881 -0.0758662 0.074301 -0.0062877 -0.0054942 -0.0061943 0.1527326 0.066267 -0.0611797 -0.0048448 -0.0235446 0.0801208 -0.0064379 -0.0022874 -0.0067193 0.1707531 0.1055383 0.038063 0.0021856 0.0068926 0.0438209 -0.0088126 0.00015 -0.0088436 0.169236 0.0425059 -0.0615364 -0.0050274 -0.0681157 0.0917517 -0.0089899 -0.0050494 -0.011867 0.2195907 0.2212037 -0.0073771 0.0019179 0.0142627 0.1005616 -0.0239996 0.0073987 -0.019129 0.3422125 -0.3131849 -0.1077848 -0.002894 0.0060406 0.0339559 -0.0101231 0.012125 -0.0066999 0.1255404 unknown
polarizability: 302.1389495|-18.9472311|188.8150922|-0.0105968|9.8041594|58.6001993 unknown
InChI: InChI=1S/C10H7N3O3S/c14-6-11-10-12-9(5-17-10)7-1-3-8(4-2-7)13(15)16/h1-6,11H
charge 0 multiplicity 1
24 atoms
S  -3.430448 2.269265 0.125367
O  5.327707 0.300219 0.036683
O  4.688244 -1.885087 -0.122185
O  -3.700941 -2.562511 -0.306537
N  -2.088985 -0.056251 -0.019082
N  -4.49858 -0.336192 -0.049035
N  4.424151 -0.622926 -0.033907
C  0.305239 0.587924 0.028807
C  -1.120176 0.968062 0.049285
C  1.345288 1.55753 0.101324
C  0.649208 -0.790882 -0.065957
C  3.003944 -0.208324 -0.012694
C  2.69374 1.168057 0.08128
C  1.995229 -1.194625 -0.087258
C  -1.64087 2.256752 0.132509
C  -3.314117 0.401303 0.006628
C  -4.62919 -1.73728 -0.197685
H  1.104934 2.62308 0.174413
H  -0.158988 -1.525759 -0.121801
H  3.505826 1.897433 0.136543
H  2.277012 -2.24811 -0.160074
H  -1.111094 3.203909 0.19898
H  -5.37398 0.189129 0.020795
H  -5.708953 -2.013616 -0.204902
