program: Gaussian 09
title: 000101255
version: EM64L-G09RevD.01
frameworkgroup: C1[X(C10H13N5O4)]
method: RPBEPBE
basis: SDD
operation: Freq
keyword: #p
keyword: freq=noraman
keyword: PBEPBE/SDD
title: #p freq=noraman PBEPBE/SDD
converged: YES YES NO NO
title: Mulliken charges:
elementType: O O O O N N N N N C C C C C C C C C C H H H H H H H H H H H H H
charge: -0.272663 -0.491531 -0.497600 -0.220319 -0.220003 -0.454877 -0.032554 -0.065228 -0.626293 -0.032642 -0.162822 -0.183216 -0.032306 -0.687768 0.359720 -0.228376 -0.148222 0.011013 0.152454 0.257344 0.294147 0.251302 0.242532 0.254882 0.215195 0.230108 0.283959 0.394969 0.373859 0.374878 0.309553 0.350508
chargesum: 0.00000
title: Mulliken charges with hydrogens summed into heavy atoms:
elementType: O O O O N N N N N C C C C C C C C C C
charge: -0.272663 -0.096562 -0.123742 -0.220319 -0.220003 -0.079999 -0.032554 -0.065228 0.033768 0.224702 0.131325 0.068086 0.210226 0.012416 0.359720 0.055583 -0.148222 0.011013 0.152454
polarizability: 2.03334084e+02 -2.28005512e-02 1.71245135e+02 -6.84213464e+00 -6.06000979e-01 8.93423224e+01
1716.lowfreq: -21.2133 -6.0668 -0.0002 0.0006 0.0009 3.5353 13.1167 32.0775 59.0737
frequency: -13.7757 31.9984 59.0477 85.6823 107.4957 122.2804 178.6141 199.1153 207.2691 216.4455 241.1183 256.1564 261.1769 278.4955 301.7313 314.8674 323.4107 338.3330 351.0424 395.7383 464.1263 474.9436 507.5584 520.4068 553.4874 576.7103 607.6147 620.6050 642.9303 648.5888 648.8177 692.8210 697.8600 754.9850 765.6369 785.8791 794.9793 803.5152 833.4755 865.0097 900.9215 938.8967 970.7026 984.0440 986.8535 1006.9312 1037.9141 1048.3822 1059.5848 1096.3312 1107.7349 1145.9864 1154.4021 1162.9679 1197.9775 1218.6795 1250.3600 1265.0045 1267.0588 1283.4230 1295.2085 1313.9754 1329.7928 1343.9932 1355.0723 1367.3431 1386.7960 1391.0664 1393.1249 1424.3371 1460.0238 1473.2076 1524.9051 1556.4282 1602.5057 1618.9738 1643.2022 2968.9749 2989.7922 3022.6490 3029.0607 3077.6239 3085.9876 3105.9096 3266.1264 3313.0386 3440.3090 3555.0044 3616.1584 3710.3876
redmass: 3.8228 5.3297 6.7760 5.2307 6.2074 6.8060 7.9780 1.3754 7.0989 2.1805 3.9343 1.3653 1.1260 5.5403 4.3131 4.7622 5.7757 4.4031 4.4360 4.7130 5.7123 4.6947 1.1172 6.1448 3.9726 1.2647 4.5143 4.4877 7.3263 7.6354 6.9500 10.2175 4.5639 1.8019 1.6211 2.3067 3.9312 3.0224 5.4924 3.3008 2.0516 7.0961 3.4178 2.6563 2.1350 3.9747 4.4006 3.5945 2.4523 2.0760 1.9439 2.5635 1.9927 2.1314 2.1347 1.3711 1.6247 2.8738 1.3531 1.3059 1.3116 1.6651 3.2680 1.4093 2.2802 1.5082 1.2940 4.6983 1.2338 4.4005 1.0558 1.0468 6.0867 3.0301 1.3712 9.0410 3.8696 1.0847 1.0370 1.0869 1.0878 1.0887 1.0989 1.0992 1.0985 1.0840 1.0644 1.0449 1.0672 1.1054
irintensity: 2.6920 2.2620 2.5960 3.5627 4.5119 0.5305 2.5081 0.4070 2.8867 5.8808 9.8440 113.9810 126.5971 11.0136 1.6024 1.4727 5.0463 1.9632 11.2759 3.6759 12.5261 2.4418 166.8838 2.8523 15.4784 90.7338 28.6847 24.5419 9.9902 3.7738 3.3281 17.2355 37.5527 133.4324 18.5955 1.4164 11.3706 41.6481 3.1152 7.2559 13.9770 64.3652 83.4921 31.8245 34.4541 28.7675 170.1626 19.1162 48.2694 33.2032 9.7395 14.9742 14.6669 23.5015 71.0808 62.2241 15.5307 1.9766 23.9404 12.9263 4.0587 8.4402 58.6723 27.2512 124.3271 8.6489 5.8566 106.0883 57.1000 34.4491 9.0707 13.1184 291.8565 98.5469 57.1465 617.0780 373.7957 27.6221 10.7544 27.4151 28.9342 11.6953 38.9372 14.1193 2.5753 469.3877 72.8231 88.1305 29.7257 43.9514
temp: 298.150 k
press: 1.00000 atm
elementType: 8 8 8 8 7 7 7 7 7 6 6 6 6 6 6 6 6 6 6 1 1 1 1 1 1 1 1 1 1 1 1 1
symmnumber: 1
zpe: 635666.3 jmol-1
zpe.correction: 0.242113 hartree
zpe.thermalcorrener: 0.258643 hartree
zpe.thermalcorrenthalpy: 0.259587 hartree
zpe.thermalcorrgfe: 0.198489 hartree
zpe.sumelectzpe: -962.082436 hartree
zpe.sumelectthermal: -962.065905 hartree
zpe.sumelectthermalent: -962.064961 hartree
zpe.sumelectthermalfe: -962.126059 hartree
dipole: 15.3063 8.5101 0.5798
dipole: 17.5226
quadrupole: -121.6606 -108.3143 -109.9742
quadrupole: -19.8982 5.6593 -2.1367
quadrupole: -8.3442 5.0021 3.3421 -19.8982 5.6593 -2.1367
hfenergy: -962.324548 hartree
pointgroup: C01 [X(C10H13N5O4)]
dipole: 5.9940947 3.3680342 0.5035309 debye
polarizability: 202.9003329|1.4995576|170.1092997|-9.6713056|9.5864953|90.911908 unknown
InChI: InChI=1S/C10H13N5O4/c1-3-5(16)6(17)9(19-3)15-2-12-4-7(15)13-10(11)14-8(4)18/h2-3,5-6,9,13,16-17H,11H2,1H3
charge 0 multiplicity 1
32 atoms
O  2.551947 -1.086884 -0.979114
O  1.376996 2.212184 0.138143
O  3.785092 1.811687 -0.747866
O  -4.345734 -1.623267 0.043279
N  0.213395 -0.77325 -0.646983
N  -1.240654 1.170057 -0.029444
N  -1.395613 -2.401199 -0.65748
N  -3.571883 0.583998 0.300042
N  -2.84802 2.792007 0.586207
C  1.49324 -0.087323 -0.878401
C  1.890446 0.857909 0.299859
C  3.436172 0.801569 0.267945
C  3.740702 -0.649075 -0.172199
C  3.947552 -1.619281 0.998487
C  -0.995303 -0.163283 -0.321728
C  -0.097663 -2.145752 -0.855888
C  -1.982619 -1.162243 -0.321156
C  -3.380839 -0.813272 0.007781
C  -2.585104 1.466769 0.281971
H  1.442603 0.494223 -1.822752
H  1.495212 0.467985 1.251396
H  3.895795 1.04965 1.242649
H  4.605199 -0.678951 -0.861228
H  3.990622 -2.652702 0.616694
H  4.89735 -1.406671 1.523489
H  3.119662 -1.563823 1.727405
H  0.672038 -2.859226 -1.131513
H  2.043935 2.696316 -0.426083
H  4.760246 1.957901 -0.79238
H  -0.470179 1.85894 0.008684
H  -2.136796 3.517685 0.586042
H  -3.812702 3.017522 0.814342
