program: Gaussian 09
title: 000149846
version: EM64L-G09RevD.01
frameworkgroup: C1[X(C13H11N2O6P)]
method: RPBEPBE
basis: SDD
operation: Freq
keyword: #p
keyword: freq=noraman
keyword: PBEPBE/SDD
title: #p freq=noraman PBEPBE/SDD
converged: YES YES NO NO
title: Mulliken charges:
elementType: P O O O O O O N N C C C C C C C C C C C C C H H H H H H H H H H H
charge: 1.117988 -0.530484 -0.610690 -0.193870 -0.191512 -0.211324 -0.214300 0.029429 0.022202 -0.189132 -0.852335 -0.209871 -0.248486 0.379921 -0.341168 -0.329581 0.388440 -0.308666 -0.353765 0.382164 -0.337249 -0.333036 0.271493 0.295946 0.263192 0.266194 0.297677 0.296359 0.297517 0.307088 0.260640 0.289204 0.290015
chargesum: 0.00000
title: Mulliken charges with hydrogens summed into heavy atoms:
elementType: P O O O O O O N N C C C C C C C C C C C C C
charge: 1.117988 -0.530484 -0.610690 -0.193870 -0.191512 -0.211324 -0.214300 0.029429 0.022202 -0.189132 -0.021704 0.056324 0.049190 0.379921 -0.044809 -0.032064 0.388440 -0.001578 -0.093125 0.382164 -0.048044 -0.043022
polarizability: 2.39824088e+02 -1.07446989e+01 1.98413316e+02 -2.70857696e+00 1.86739795e+00 1.96593872e+02
1716.lowfreq: -5.3305 -0.0019 -0.0011 -0.0005 3.5950 8.1107 11.8269 22.2027 28.3883
frequency: 11.8035 22.1698 28.3444 59.2329 65.2277 71.5443 85.7252 89.9491 113.2402 124.2624 155.6666 184.5885 196.3319 208.7123 223.9097 254.9449 282.0180 308.4933 333.4664 349.7689 373.5868 405.5024 416.0371 432.4148 485.9530 493.6454 499.0347 503.8776 509.1992 557.0719 619.7913 624.2598 659.0013 666.1593 668.4140 684.5515 715.4238 734.2341 746.2628 776.4662 791.3703 834.3583 837.8915 861.0276 868.8865 879.8352 923.8926 950.2552 984.0012 994.3943 994.9055 998.8019 1004.7378 1009.6234 1030.0545 1086.6490 1089.8223 1095.0566 1108.4634 1110.6952 1168.7755 1181.8332 1208.6061 1218.5305 1223.9208 1292.2749 1293.2036 1337.2982 1357.6567 1367.9785 1395.6274 1397.6287 1406.4254 1428.5286 1430.1951 1437.8548 1463.2924 1473.6966 1590.3068 1594.4354 1595.3721 1603.7478 3022.2374 3144.7952 3147.4418 3150.1575 3151.9005 3157.5248 3168.0344 3184.5002 3185.6141 3187.6333 3189.5621
redmass: 12.3087 5.5004 6.3624 7.2541 6.3266 6.8364 7.6354 6.6802 4.7762 1.1287 3.6479 8.8186 7.3167 5.8798 9.4545 6.7456 6.4021 7.1744 7.3492 6.9260 8.1428 2.8926 3.0335 7.9956 7.1300 3.8177 4.0439 6.8316 6.9125 7.1272 7.0945 7.4782 9.1361 4.7643 5.0183 7.6118 6.0435 4.9109 4.7072 9.9085 8.8868 6.1795 1.2992 1.3318 1.5781 1.4269 1.5409 1.3627 1.3284 1.3437 1.3542 3.0141 3.8396 1.3600 4.7621 6.3076 2.4056 3.1921 1.2661 1.3418 1.4615 1.2860 3.6203 5.8969 6.3012 1.2665 1.2733 1.1679 7.8339 5.8466 6.1639 10.2781 5.6884 3.7066 1.0704 1.0518 2.1661 2.3899 7.7520 6.2079 7.9703 6.5773 1.0314 1.1022 1.1018 1.0910 1.0915 1.0922 1.0892 1.0951 1.0946 1.0959 1.0971
irintensity: 0.2592 0.0401 0.2473 3.0936 0.1427 0.1090 4.9213 3.1386 2.8145 0.8819 2.8825 5.2936 3.6906 2.1366 3.1154 2.1958 0.6626 2.3479 18.1329 25.4137 39.1098 0.5203 0.1139 23.2959 4.9821 21.5943 44.7664 0.9383 28.1001 15.5957 0.4114 20.8618 60.8755 21.1652 15.0438 89.7351 91.8318 7.1331 16.6584 15.6741 18.0259 242.9815 8.6411 17.8104 83.5097 26.0161 10.2639 111.3008 0.4506 0.5759 2.0100 5.7357 7.8151 0.9386 79.7857 6.0768 83.2548 19.2689 16.0652 17.4620 276.5396 20.9067 388.2827 150.7221 292.1825 0.3464 0.0198 23.2102 83.4572 38.4746 9.4933 31.9499 111.7210 22.4765 8.6860 17.5653 3.1279 119.2135 53.3784 5.7874 2.1907 189.1806 0.5497 1.0888 1.1039 2.2785 2.4454 2.1208 1.5868 0.8376 1.6945 2.5158 3.5195
temp: 298.150 k
press: 1.00000 atm
elementType: 15 8 8 8 8 8 8 7 7 6 6 6 6 6 6 6 6 6 6 6 6 6 1 1 1 1 1 1 1 1 1 1 1
symmnumber: 1
zpe: 594254.5 jmol-1
zpe.correction: 0.226340 hartree
zpe.thermalcorrener: 0.246907 hartree
zpe.thermalcorrenthalpy: 0.247852 hartree
zpe.thermalcorrgfe: 0.173285 hartree
zpe.sumelectzpe: -1402.310420 hartree
zpe.sumelectthermal: -1402.289852 hartree
zpe.sumelectthermalent: -1402.288908 hartree
zpe.sumelectthermalfe: -1402.363474 hartree
dipole: -4.1688 6.2145 -3.3518
dipole: 8.1996
quadrupole: -180.1874 -146.4330 -130.1140
quadrupole: -4.6277 -4.5507 -7.9021
quadrupole: -27.9426 5.8118 22.1308 -4.6277 -4.5507 -7.9021
hfenergy: -1402.5367597 hartree
pointgroup: C01 [X(C13H11N2O6P1)]
dipole: 1.6420799 -2.4776229 -1.2537354 debye
polarizability: 239.9623673|-10.4806435|198.1993427|2.7310582|-1.82913|196.6695661 unknown
InChI: InChI=1S/C13H11N2O6P/c1-22(20,13-8-4-11(5-9-13)15(18)19)21-12-6-2-10(3-7-12)14(16)17/h2-9H,1H3
charge 0 multiplicity 1
33 atoms
P  0.645746 -2.547196 0.303835
O  -0.69148 -2.069505 -0.782142
O  0.282001 -2.834512 1.836001
O  4.787125 2.654048 -1.317171
O  5.125492 2.562329 0.937377
O  -5.149912 1.92965 1.475517
O  -5.485007 2.11509 -0.774626
N  4.569246 2.151064 -0.150051
N  -4.867112 1.626635 0.251079
C  1.826337 -1.114875 0.123402
C  1.20663 -3.994958 -0.711484
C  2.085804 -0.526988 -1.137454
C  2.450681 -0.63171 1.297602
C  -1.699481 -1.147216 -0.451151
C  2.987735 0.551107 -1.232701
C  3.35487 0.4465 1.213746
C  3.60919 1.013662 -0.052618
C  -2.041813 -0.807464 0.88436
C  -2.398833 -0.589862 -1.551421
C  -3.771553 0.665235 0.00777
C  -3.083215 0.111048 1.10971
C  -3.443651 0.320245 -1.324005
H  2.12741 -4.406691 -0.269671
H  0.4110 -4.75535 -0.690211
H  1.38904 -3.67737 -1.749183
H  1.573472 -0.888146 -2.035428
H  2.215708 -1.095398 2.26179
H  3.212646 1.035787 -2.186101
H  3.857807 0.849082 2.096639
H  -1.514581 -1.269749 1.724469
H  -2.114042 -0.884611 -2.565242
H  -3.376718 0.397261 2.123042
H  -4.003341 0.768359 -2.148878
