program: Gaussian 09
title: 000149871
version: EM64L-G09RevD.01
frameworkgroup: C1[X(C26H25Cl2N3)]
method: RPBEPBE
basis: SDD
operation: Freq
keyword: #p
keyword: freq=noraman
keyword: PBEPBE/SDD
title: #p freq=noraman PBEPBE/SDD
converged: YES YES NO NO
title: Mulliken charges:
elementType: Cl Cl N N N C C C C C C C C C C C C C C C C C C C C C C C C C C H H H H H H H H H H H H H H H H H H H H H H H H H
charge: -0.068397 -0.068221 -0.131611 -0.506248 -0.040888 0.441190 -0.719242 0.528504 -0.421033 -0.418524 0.520870 -0.363323 -0.364033 -0.408941 -0.496516 0.459495 -0.359563 -0.466029 -0.553892 -0.555409 -0.452952 -0.392564 0.348763 0.228192 -0.039166 -0.331837 -0.360602 -0.305247 -0.382945 -0.270444 -0.224405 0.225842 0.223787 0.273802 0.235391 0.273910 0.234825 0.220203 0.219565 0.238430 0.228265 0.245275 0.234902 0.289720 0.262275 0.288657 0.261789 0.229361 0.269408 0.304351 0.257882 0.202390 0.261630 0.234105 0.227901 0.231349
chargesum: 0.00000
title: Mulliken charges with hydrogens summed into heavy atoms:
elementType: Cl Cl N N N C C C C C C C C C C C C C C C C C C C C C C C C C C
charge: -0.068397 -0.068221 -0.131611 -0.201897 -0.040888 0.441190 -0.269612 0.528504 0.088161 0.090210 0.520870 -0.143120 -0.144469 -0.170511 -0.268252 0.459495 -0.114287 -0.231127 -0.001897 -0.004962 -0.223591 -0.123155 0.348763 0.228192 -0.039166 -0.073955 -0.158212 -0.043617 -0.148840 -0.042543 0.006944
polarizability: 5.31671976e+02 9.55331769e+00 2.88193945e+02 -4.57940090e+01 -4.89780387e+00 2.47952383e+02
1716.lowfreq: -9.9320 -1.8949 -0.0013 -0.0010 0.0007 3.7942 6.7792 7.9000 12.6485
frequency: 4.7156 7.1880 12.4959 29.2617 31.4477 40.0971 46.7678 63.5159 73.8775 80.6522 88.6000 98.4941 117.1567 124.8952 143.1866 173.8632 180.4915 198.0096 201.5146 239.2953 254.2783 279.1703 324.0634 328.4869 348.9576 362.4426 375.9830 407.4097 412.4006 413.5383 427.3355 433.9315 448.6895 473.1459 485.8216 501.8995 509.6941 512.3666 519.7278 526.9923 546.2028 578.2601 591.5651 599.4921 604.2279 625.2266 637.6030 638.7639 653.2771 670.8296 712.5865 719.9786 748.3447 761.7519 778.4356 789.7604 800.0988 804.3261 806.1042 812.0097 826.3900 827.8735 841.3900 859.6416 866.0385 868.6872 870.0011 877.9071 917.5673 920.7180 944.7244 946.2574 951.1432 954.6901 958.1693 966.0060 971.9009 993.2832 999.5017 1006.2715 1006.6803 1023.0360 1029.7673 1047.4310 1048.0793 1088.9927 1120.7747 1134.7523 1145.0270 1158.9453 1170.9799 1176.4651 1180.9967 1186.3845 1191.9402 1198.9116 1212.9366 1223.3772 1231.1003 1232.4141 1240.1752 1261.0946 1264.6879 1285.7524 1293.4362 1293.8791 1305.2230 1323.7965 1334.5656 1344.0833 1353.3286 1355.8411 1364.0132 1377.9095 1382.4897 1385.7343 1397.6845 1415.0789 1427.7830 1435.2270 1438.6890 1440.7848 1448.5848 1461.3926 1462.6432 1482.5379 1488.5161 1509.7971 1520.8544 1529.7932 1555.5715 1568.1798 1584.4659 1593.7968 1621.8849 1626.1724 1633.4031 2963.4109 2967.1678 2972.0081 3007.5656 3053.6374 3054.1321 3070.8356 3077.4248 3111.7422 3111.8973 3113.6430 3119.0527 3120.8967 3123.3917 3135.9746 3141.2795 3143.2284 3143.6990 3154.7104 3154.9027 3159.9266 3163.8062 3171.3893 3180.9192 3544.3855
redmass: 8.2170 5.6684 7.7253 8.5761 9.8130 5.5243 5.6412 4.9736 4.8255 5.4606 4.5133 4.4248 4.0907 3.9389 4.6333 4.4942 4.4621 4.8421 5.6694 4.1562 5.6864 4.6355 2.9424 4.8976 3.5219 2.6564 3.2125 3.2730 3.1448 3.0724 3.2866 2.7641 2.9276 3.2829 2.3099 2.8268 4.1690 3.8605 1.8903 3.2991 3.2273 4.4156 3.3802 4.8632 4.3611 5.1109 6.4272 5.4071 4.0946 3.4944 3.3053 3.5457 4.4693 1.5061 3.3095 2.9865 3.0159 1.5698 3.2207 1.6881 3.1644 1.4452 1.9025 1.4621 2.4337 1.8240 2.0319 3.8673 1.5039 1.8315 1.5099 1.9709 1.3991 1.3579 1.4019 1.6136 1.3577 1.3302 3.1061 1.8665 2.9357 2.8239 2.7063 2.2901 1.8395 2.5645 1.4091 1.5202 1.3798 1.1491 1.3937 1.1837 1.8164 1.1788 1.1489 1.6503 1.5328 1.9317 1.8501 1.3317 2.0309 1.5147 2.2204 1.6790 1.2804 1.9987 1.2006 1.6377 1.4352 2.1480 1.3497 1.5648 2.5562 4.3435 3.5924 1.6768 3.6846 3.2311 2.5749 2.5912 1.1173 1.1358 2.4070 1.1213 1.1375 2.2599 1.1519 2.8731 2.6079 3.7160 5.4378 6.5362 6.4875 4.0341 6.0391 6.3628 6.3323 1.0597 1.0690 1.0691 1.1003 1.0584 1.0580 1.0925 1.0923 1.0891 1.0868 1.0878 1.0900 1.0897 1.0882 1.0884 1.0959 1.1099 1.1097 1.0944 1.0931 1.0937 1.0946 1.0992 1.0933 1.0748
irintensity: 0.0969 0.6164 0.0374 0.2833 0.7566 0.6533 0.2139 2.6830 4.1133 0.7062 4.6676 1.9712 2.8565 0.4908 0.5827 1.7329 2.3681 1.5986 2.5862 3.8903 1.1155 3.0452 1.6369 0.3140 4.9255 1.6539 3.2841 1.3265 0.4310 2.2739 2.2137 24.0621 12.0798 2.5493 84.5604 21.9474 9.1999 2.6324 50.1566 2.7694 4.3314 9.4811 11.9237 13.4896 25.9700 5.1723 0.7067 5.3899 7.5233 6.1342 4.8538 2.4644 16.2872 51.1906 26.4006 17.5442 2.3081 22.4417 7.1937 45.0278 3.5797 24.4569 56.6320 3.4889 9.0857 0.5218 7.8928 9.1837 20.8786 51.9248 7.3661 11.1796 1.3404 0.8806 2.1401 3.4943 0.4617 0.4523 0.8639 3.3752 5.3084 9.4771 11.7312 3.1239 5.2336 4.0843 17.8360 3.3269 9.6175 8.8646 10.3249 0.6404 57.7854 7.6038 11.9094 20.1291 3.5837 2.8422 12.3479 86.2564 2.2230 7.3035 18.2421 18.3838 1.9847 1.3021 24.8939 15.8778 1.7291 115.4715 27.8174 192.6517 21.2062 9.7951 13.8221 18.7641 131.9958 2.3817 7.0513 51.4635 4.0897 14.2079 2.4120 7.9054 34.2404 7.2296 1.2245 259.6174 318.2676 479.5153 168.9673 22.1013 185.7813 19.6077 12.8731 40.0777 117.5816 39.3492 43.8601 15.8514 13.5458 33.3631 5.7460 1.7499 9.4481 19.1811 11.1074 19.2822 24.7156 25.1464 23.6023 12.6493 14.7649 16.2297 27.9526 20.2404 30.1501 15.3783 10.2462 27.0588 8.6608 14.7648
temp: 298.150 k
press: 1.00000 atm
elementType: 17 17 7 7 7 6 6 6 6 6 6 6 6 6 6 6 6 6 6 6 6 6 6 6 6 6 6 6 6 6 6 1 1 1 1 1 1 1 1 1 1 1 1 1 1 1 1 1 1 1 1 1 1 1 1 1
symmnumber: 1
zpe: 1173104.4 jmol-1
zpe.correction: 0.446812 hartree
zpe.thermalcorrener: 0.474762 hartree
zpe.thermalcorrenthalpy: 0.475706 hartree
zpe.thermalcorrgfe: 0.381053 hartree
zpe.sumelectzpe: -2087.958294 hartree
zpe.sumelectthermal: -2087.930344 hartree
zpe.sumelectthermalent: -2087.929400 hartree
zpe.sumelectthermalfe: -2088.024053 hartree
dipole: -2.0216 -2.9301 1.3633
dipole: 3.8119
quadrupole: -222.1940 -191.7696 -197.7586
quadrupole: -14.5387 -4.9586 -4.8593
quadrupole: -18.2866 12.1378 6.1488 -14.5387 -4.9586 -4.8593
hfenergy: -2088.4051058 hartree
pointgroup: C01 [X(C26H25Cl2N3)]
dipole: 0.7504304 0.6313754 -1.1346292 debye
polarizability: 534.5006548|25.0674773|244.8194678|-24.7725435|-12.1053348|288.4981813 unknown
InChI: InChI=1S/C26H25Cl2N3/c27-14-17-31(18-15-28)23-11-7-21(8-12-23)19-20-5-9-22(10-6-20)30-26-13-16-29-25-4-2-1-3-24(25)26/h1-13,16,30H,14-15,17-19H2
charge 0 multiplicity 1
56 atoms
Cl 8.403081 -1.639456 1.905023
Cl 6.984078 -2.627747 -3.264412
N  6.176419 -0.953645 -0.491703
N  -3.657762 0.339076 -0.308261
N  -6.537146 -0.966383 2.601314
C  5.07634 -0.0811 -0.353741
C  1.648418 2.677717 0.124873
C  2.816378 1.710336 -0.063235
C  6.213886 -2.241676 0.211666
C  7.328114 -0.591758 -1.326738
C  0.261345 2.044775 0.03847
C  3.954848 -0.414426 0.470927
C  5.026095 1.176208 -1.031699
C  2.861295 0.460689 0.603964
C  3.922409 2.040484 -0.881649
C  -2.359823 0.892759 -0.139017
C  -0.101495 1.2168 -1.055911
C  -0.719042 2.287596 1.031456
C  6.590005 -2.154894 1.699083
C  7.116171 -0.785791 -2.835824
C  -1.384299 0.645582 -1.14455
C  -2.013914 1.732311 0.951918
C  -4.589884 -0.03653 0.666539
C  -5.970192 -0.264156 0.266581
C  -6.893409 -0.749869 1.272826
C  -4.255336 -0.254023 2.018261
C  -6.460924 -0.027433 -1.057846
C  -8.250114 -1.018444 0.901713
C  -5.253685 -0.707057 2.926131
C  -7.793346 -0.293802 -1.390729
C  -8.693557 -0.803489 -0.405207
H  1.740548 3.183058 1.107686
H  1.735675 3.479878 -0.635891
H  6.923865 -2.907195 -0.306774
H  5.226242 -2.742865 0.142091
H  8.200885 -1.180857 -0.999782
H  7.602103 0.470617 -1.157799
H  3.92457 -1.362002 1.016557
H  5.844523 1.493623 -1.684179
H  2.019043 0.161263 1.239489
H  3.926457 2.996487 -1.421368
H  0.639527 1.002203 -1.834736
H  -0.472905 2.935136 1.882294
H  6.014092 -1.392799 2.24291
H  6.512878 -3.135844 2.194133
H  6.177422 -0.342584 -3.196822
H  7.976265 -0.416689 -3.416558
H  -1.633931 -0.007669 -1.990405
H  -2.757893 1.9792 1.714422
H  -3.911553 0.123778 -1.273389
H  -3.230261 -0.131296 2.373727
H  -5.808466 0.403873 -1.82729
H  -8.915028 -1.391527 1.686763
H  -4.978846 -0.884052 3.97343
H  -8.152419 -0.098307 -2.406996
H  -9.73445 -1.012081 -0.675535
