program: Gaussian 09
title: 000149844
version: EM64L-G09RevD.01
frameworkgroup: C1[X(C13H12ClO2P)]
method: RPBEPBE
basis: SDD
operation: Freq
keyword: #p
keyword: freq=noraman
keyword: PBEPBE/SDD
title: #p freq=noraman PBEPBE/SDD
converged: YES YES NO NO
title: Mulliken charges:
elementType: Cl P O O C C C C C C C C C C C C C H H H H H H H H H H H H
charge: -0.066853 1.117003 -0.541566 -0.628241 -0.151399 -0.863268 -0.261031 -0.295349 0.378658 -0.215244 -0.203081 -0.220118 -0.330218 -0.368433 -0.183587 -0.184078 -0.115254 0.258625 0.264630 0.288720 0.253444 0.287470 0.237317 0.238848 0.236971 0.303891 0.251374 0.255581 0.255189
chargesum: 0.00000
title: Mulliken charges with hydrogens summed into heavy atoms:
elementType: Cl P O O C C C C C C C C C C C C C
charge: -0.066853 1.117003 -0.541566 -0.628241 -0.151399 -0.051294 -0.007587 -0.007880 0.378658 0.022073 0.035767 0.016853 -0.026327 -0.117058 0.071994 0.071110 -0.115254
polarizability: 1.97344910e+02 9.25934065e+00 1.57545113e+02 1.43474978e+00 1.29308457e-01 1.64012672e+02
1716.lowfreq: -12.4588 -7.9422 -6.1284 0.0014 0.0019 0.0024 16.3554 18.9871 32.3079
frequency: 16.1833 17.6096 32.2743 78.7853 89.0095 110.2184 117.6637 143.3921 187.0897 206.0500 222.5061 241.8936 291.5946 319.7035 337.2861 353.4914 396.9742 407.1561 413.7276 446.5150 491.7444 499.5079 557.3063 610.3901 624.0449 657.4894 682.4492 698.5632 702.6460 721.8705 766.0383 815.6903 827.0280 835.2700 863.2493 919.8806 938.9239 942.2869 949.9729 963.1200 986.7833 989.3946 993.4095 1009.4697 1016.5183 1027.1654 1068.7123 1081.3233 1092.8851 1104.9166 1172.5734 1175.7622 1187.7011 1199.6755 1288.9542 1310.7928 1333.6422 1363.8949 1381.6782 1400.2031 1427.5879 1430.8837 1437.5969 1465.2011 1468.2931 1584.4763 1588.4697 1595.4436 1596.4102 3021.5405 3129.3648 3135.4196 3144.2258 3144.5860 3146.0900 3150.8831 3156.1592 3157.4795 3169.7246 3171.6501 3178.1513
redmass: 8.1273 3.8271 3.8630 6.2912 6.9975 1.2826 2.4442 5.7895 3.7967 8.2808 4.7374 6.9812 6.1559 7.1627 7.2985 6.4092 2.8794 6.8670 3.0542 7.1257 3.3998 3.3415 7.2011 6.4559 7.3588 6.9040 7.6004 3.6048 2.2257 3.9136 1.7545 1.2966 6.7949 1.4910 1.2463 1.5670 1.3516 1.3381 1.3868 1.3333 5.7838 1.4013 4.2219 1.3303 4.0156 3.1341 2.4907 1.6902 2.8345 1.3289 1.2901 1.0568 1.1754 2.8095 1.2583 1.3172 1.1708 6.9499 8.9730 3.4954 1.9670 1.0852 1.0500 2.0529 2.3167 7.4748 6.1314 6.1427 6.2669 1.0314 1.0861 1.0880 1.1015 1.0933 1.1017 1.0908 1.0966 1.0885 1.1017 1.0965 1.0978
irintensity: 0.7326 0.0350 0.1158 0.0603 4.1331 1.0030 3.0446 0.6662 1.8776 2.4083 0.6278 10.0728 0.9186 29.8752 1.8303 10.5592 2.0596 33.3302 0.1610 28.2665 27.4933 51.0725 11.3887 0.0210 16.4035 10.8751 124.4027 1.7248 39.8838 129.1274 19.5510 11.6859 119.4396 88.0419 0.4829 10.6455 17.5849 4.2640 78.6390 6.0873 2.4577 0.5378 49.0956 0.0566 36.4464 45.4758 39.2746 0.9583 67.2264 10.2144 62.4761 0.3390 23.7383 189.7529 0.4321 3.2575 25.7217 4.7523 0.7344 2.5028 22.3361 7.0464 13.7617 14.2890 242.9287 11.3604 0.1659 6.5263 13.0886 1.2359 0.3899 2.7855 1.4370 5.1170 2.4654 1.7314 17.1519 3.6337 25.8247 3.3553 3.1917
temp: 298.150 k
press: 1.00000 atm
elementType: 17 15 8 8 6 6 6 6 6 6 6 6 6 6 6 6 6 1 1 1 1 1 1 1 1 1 1 1 1
symmnumber: 1
zpe: 562135.3 jmol-1
zpe.correction: 0.214106 hartree
zpe.thermalcorrener: 0.230732 hartree
zpe.thermalcorrenthalpy: 0.231677 hartree
zpe.thermalcorrgfe: 0.166624 hartree
zpe.sumelectzpe: -1453.097892 hartree
zpe.sumelectthermal: -1453.081265 hartree
zpe.sumelectthermalent: -1453.080321 hartree
zpe.sumelectthermalfe: -1453.145374 hartree
dipole: -4.4233 1.7614 3.1175
dipole: 5.6910
quadrupole: -115.1430 -110.0496 -107.7571
quadrupole: -5.2526 -2.5081 -5.8510
quadrupole: -4.1598 0.9336 3.2262 -5.2526 -2.5081 -5.8510
hfenergy: -1453.3119978 hartree
pointgroup: C01 [X(C13H12Cl1O2P1)]
dipole: 1.7561537 -0.5014704 1.2952035 debye
polarizability: 195.413696|12.674353|159.5440834|-0.7376281|0.2498269|163.9449158 unknown
InChI: InChI=1S/C13H12ClO2P/c1-17(15,13-5-3-2-4-6-13)16-12-9-7-11(14)8-10-12/h2-10H,1H3
charge 0 multiplicity 1
29 atoms
Cl -5.238585 -1.458558 -0.519914
P  1.295839 1.63676 -0.296362
O  -0.173312 1.582197 0.712836
O  1.09582 1.991379 -1.847298
C  2.056451 -0.040807 -0.041495
C  2.166967 2.920526 0.724463
C  2.109077 -0.638918 1.239674
C  2.579301 -0.704589 -1.175852
C  -1.331965 0.853365 0.356219
C  2.699808 -1.913594 1.38528
C  3.168815 -1.979424 -1.021784
C  3.231884 -2.58125 0.256514
C  -1.700068 0.591401 -0.986632
C  -2.149992 0.427843 1.428476
C  -2.891518 -0.121137 -1.249277
C  -3.346223 -0.272735 1.163729
C  -3.696085 -0.5425 -0.174085
H  2.22493 2.591135 1.772813
H  3.177942 3.074982 0.316266
H  1.590999 3.856277 0.659876
H  1.674251 -0.131308 2.108411
H  2.509524 -0.224334 -2.158442
H  2.739388 -2.387067 2.372075
H  3.574148 -2.501076 -1.895263
H  3.687758 -3.570756 0.372804
H  -1.072914 0.947022 -1.810465
H  -1.84747 0.652676 2.455424
H  -3.188251 -0.332845 -2.280496
H  -3.988419 -0.604367 1.984604
