program: Gaussian 09
title: 000149836
version: EM64L-G09RevD.01
frameworkgroup: C1[X(C18H22O2)]
method: RPBEPBE
basis: SDD
operation: Freq
keyword: #pfreq=noraman
keyword: PBEPBE/SDD
title: #p freq=noraman PBEPBE/SDD
converged: YES YES NO NO
title: Mulliken charges:
elementType: O O C C C C C C C C C C C C C C C C C C H H H H H H H H H H H H H H H H H H H H H H
charge: -0.452672 -0.237923 -0.148280 0.299217 -0.217519 -0.210111 -0.556904 -0.468239 0.266878 -0.486069 -0.228939 -0.799407 -0.371319 0.095717 -0.602289 0.391178 -0.543135 -0.530216 -0.525323 0.157622 0.279759 0.233405 0.217283 0.219943 0.230418 0.221456 0.214564 0.220661 0.221955 0.239034 0.237147 0.231769 0.223804 0.208218 0.221397 0.235248 0.333698 0.231785 0.218383 0.253009 0.231596 0.243205
chargesum: 0.00000
title: Mulliken charges with hydrogens summed into heavy atoms:
elementType: O O C C C C C C C C C C C C C C C C C C
charge: -0.118974 -0.237923 0.131479 0.299217 0.015886 0.007171 -0.106543 -0.032219 0.266878 -0.043454 0.010095 -0.106687 -0.163101 0.095717 -0.145645 0.391178 -0.092968 -0.277208 -0.050522 0.157622
polarizability: 3.54383582e+02 1.43610422e+01 1.77571586e+02 -1.37906215e+01 -1.77562107e-01 1.32789089e+02
1716.lowfreq: -13.0166 -6.6553 -3.4539 -0.0003 0.0004 0.0005 24.7403 52.0259 82.1793
frequency: 24.5741 51.9525 82.1492 101.6238 135.9829 152.1974 155.3361 187.6021 202.0997 220.1245 241.0754 253.1440 259.9521 279.4988 295.8208 334.1135 362.1613 378.2033 409.2669 417.5760 424.0902 435.3082 484.1126 486.8312 523.1416 528.1922 558.6102 589.7823 599.9601 640.0549 651.1139 681.1460 696.8418 752.5790 772.5025 780.1730 782.2677 786.2922 859.4054 867.7645 873.7810 875.3279 897.4522 934.1679 936.6927 958.8389 966.8137 981.2242 996.9624 1009.9116 1020.0462 1025.7460 1040.9112 1054.7739 1067.1002 1098.9413 1107.9333 1118.5659 1137.4852 1145.8740 1154.4330 1170.0685 1172.5186 1184.3628 1194.8485 1205.0364 1212.6759 1226.4130 1236.8128 1249.5960 1256.6946 1273.5827 1280.4428 1290.0016 1295.7198 1299.6578 1309.3326 1324.1573 1326.5234 1347.0526 1352.4540 1367.2185 1370.9863 1388.5529 1393.0224 1404.2043 1443.4832 1452.5243 1454.8699 1456.5530 1469.4406 1471.4840 1483.2849 1487.2384 1544.6088 1569.1814 1579.7045 1603.7079 2916.3556 2955.7625 2960.7938 2965.4829 2975.7899 2980.4645 2982.2300 2982.6029 2990.8656 3005.4431 3042.3107 3046.2831 3050.4948 3065.6407 3067.9785 3068.6097 3072.7281 3090.0980 3117.7087 3127.0038 3147.2652 3563.7691
redmass: 5.4758 3.6019 4.3685 2.3424 3.5841 4.3747 2.7636 3.6368 2.0666 2.4727 1.3104 1.9721 1.4118 2.5443 2.9005 3.8187 3.9952 2.5964 3.2039 4.1447 3.1349 3.5328 3.8933 4.3203 2.9299 3.1068 3.3824 3.8191 2.7341 3.1828 3.4737 3.2860 2.7552 2.4199 2.2928 2.1271 2.4582 2.7772 2.0868 2.4011 1.7556 2.0869 2.0113 2.0412 1.8935 1.5102 1.5618 2.4648 2.2133 2.0664 2.5157 2.8125 2.5941 2.3922 2.0482 2.4972 1.9366 1.7432 1.9705 1.3624 1.2373 1.8436 1.6376 1.4977 1.8625 1.3123 1.4370 1.3891 1.6539 1.4919 1.5234 1.6823 1.7586 1.4269 1.4057 1.3710 1.7665 1.5043 1.4653 1.5235 1.4958 1.4213 1.4872 1.3319 3.7966 1.6241 1.0872 1.0809 1.0876 1.0980 1.0949 1.0735 1.0681 1.0718 8.6403 8.0292 7.4429 7.4234 1.0792 1.0667 1.0697 1.0843 1.0792 1.0638 1.0584 1.0405 1.0632 1.0654 1.0958 1.1009 1.1002 1.0901 1.1007 1.0969 1.1013 1.0986 1.0853 1.0910 1.0955 1.0662
irintensity: 0.9871 2.3731 0.6536 0.2423 2.1856 3.8425 0.5211 3.7546 1.1836 3.1299 5.3336 40.0338 91.2004 12.1113 7.2505 0.6488 8.5667 5.4922 4.3209 2.6092 4.7860 0.2063 2.3519 3.4385 0.9318 3.0457 2.0438 2.6475 0.0473 1.2481 3.6436 7.3909 12.0880 11.4019 12.8407 9.6851 2.0359 11.0062 0.9235 9.7763 12.1217 10.6927 22.8925 9.8208 23.4154 19.9653 13.6023 1.5549 0.4873 7.1956 21.9183 19.8829 2.3927 5.0551 26.8642 2.1211 1.7384 19.2171 11.4107 1.5496 5.4216 12.8448 1.2393 6.2713 47.8814 11.8981 6.4165 46.4257 12.3560 13.7511 3.6547 42.9797 25.9448 5.2230 6.8937 9.9717 10.7997 2.4260 1.0178 5.0153 2.9169 4.6124 5.7538 11.1207 31.3600 4.6032 13.4586 9.2666 12.5732 5.4582 8.3671 5.2779 3.2897 11.4713 67.5749 63.6313 457.1104 37.3519 12.0953 20.3686 19.6751 49.0448 13.3853 20.4270 45.5898 28.0147 30.4986 68.0819 40.1497 30.2049 12.3112 20.1774 46.8458 21.5057 32.2678 43.4662 0.3828 7.6782 31.9031 3.2616
temp: 298.150 k
press: 1.00000 atm
elementType: 8 8 6 6 6 6 6 6 6 6 6 6 6 6 6 6 6 6 6 6 1 1 1 1 1 1 1 1 1 1 1 1 1 1 1 1 1 1 1 1 1 1
symmnumber: 1
zpe: 934111.8 jmol-1
zpe.correction: 0.355784 hartree
zpe.thermalcorrener: 0.373567 hartree
zpe.thermalcorrenthalpy: 0.374512 hartree
zpe.thermalcorrgfe: 0.310862 hartree
zpe.sumelectzpe: -848.049607 hartree
zpe.sumelectthermal: -848.031824 hartree
zpe.sumelectthermalent: -848.030880 hartree
zpe.sumelectthermalfe: -848.094530 hartree
dipole: -8.2632 0.8347 0.8126
dipole: 8.3449
quadrupole: -145.5202 -112.5392 -117.8748
quadrupole: -2.0621 4.4205 -1.0199
quadrupole: -20.2088 12.7722 7.4366 -2.0621 4.4205 -1.0199
hfenergy: -848.4053919 hartree
pointgroup: C01 [X(C18H22O2)]
dipole: 3.2536793 -0.3589053 0.2526942 debye
polarizability: 355.1800803|12.6093804|177.2616343|8.5608862|-1.0315802|132.3025422 unknown
InChI: InChI=1S/C18H22O2/c1-18-9-8-14-13-5-3-12(19)10-11(13)2-4-15(14)16(18)6-7-17(18)20/h8-10,15-17,20H,2-7H2,1H3
charge 0 multiplicity 1
42 atoms
O  3.790783 1.285949 -1.67401
O  -5.823958 0.139761 -0.244835
C  1.97163 -0.616976 -0.31449
C  2.751518 0.53224 0.395781
C  0.611565 -0.882052 0.355138
C  4.067088 0.545563 -0.427695
C  3.017947 -1.747397 -0.436277
C  4.36186 -0.973242 -0.688323
C  -0.222756 0.417702 0.329601
C  -0.161469 -2.064985 -0.261815
C  1.892863 1.774974 0.373035
C  3.127426 0.219849 1.879751
C  0.522592 1.682616 0.36996
C  -1.616633 0.379154 0.265061
C  -1.541335 -2.18535 0.414345
C  -2.338552 -0.899681 0.251478
C  -2.491074 1.633927 0.307228
C  -3.716816 -0.958098 0.118067
C  -3.798198 1.497693 -0.508601
C  -4.554419 0.208989 -0.183099
H  1.771835 -0.241529 -1.34011
H  0.793216 -1.14131 1.423413
H  4.900544 1.036748 0.11732
H  2.78496 -2.447689 -1.256857
H  3.072562 -2.341626 0.496218
H  5.167927 -1.341015 -0.027742
H  4.706618 -1.110631 -1.730217
H  0.412051 -3.001234 -0.126243
H  -0.285787 -1.905495 -1.351402
H  2.378326 2.758377 0.388305
H  2.22865 0.079646 2.503692
H  3.754409 -0.686193 1.967711
H  3.694886 1.066495 2.308544
H  -0.050615 2.615589 0.390788
H  -1.388628 -2.385431 1.496578
H  -2.115685 -3.038353 0.01062
H  4.588236 1.24103 -2.259362
H  -2.75908 1.832581 1.36678
H  -1.943535 2.521615 -0.049431
H  -4.237694 -1.921636 0.183156
H  -3.562647 1.477546 -1.592711
H  -4.467611 2.358578 -0.337152
