program: Gaussian 09
title: 000009119
version: EM64L-G09RevD.01
frameworkgroup: C1[X(C24H14)]
method: RPBEPBE
basis: SDD
operation: Freq
keyword: #p
keyword: freq=noraman
keyword: PBEPBE/SDD
title: #p freq=noraman PBEPBE/SDD
converged: YES YES NO NO
title: Mulliken charges:
elementType: C C C C C C C C C C C C C C C C C C C C C C C C H H H H H H H H H H H H H H
charge: -0.034006 0.083126 -0.050188 0.269346 0.258228 0.513651 0.149753 0.178628 0.465477 0.445783 -0.796355 -0.499686 -0.472965 -0.411909 -0.442875 -0.475563 -0.385147 -0.404486 -0.270453 -0.463354 -0.277588 -0.276264 -0.261423 -0.254146 0.246515 0.242041 0.237020 0.230410 0.299231 0.241737 0.229986 0.287307 0.229165 0.245052 0.232697 0.231705 0.228928 0.230621
chargesum: 0.00000
title: Mulliken charges with hydrogens summed into heavy atoms:
elementType: C C C C C C C C C C C C C C C C C C C C C C C C
charge: -0.034006 0.083126 -0.050188 0.269346 0.258228 0.513651 0.149753 0.178628 0.465477 0.445783 -0.549840 -0.257644 -0.235945 -0.181500 -0.143644 -0.233826 -0.155161 -0.117179 -0.041287 -0.218302 -0.044890 -0.044558 -0.032496 -0.023525
polarizability: 4.39099169e+02 4.64880003e+00 3.40256796e+02 -7.39073889e+00 8.57303989e+00 1.04670043e+02
1716.lowfreq: -3.6980 -0.0006 -0.0005 -0.0005 4.4237 10.7985 53.8577 77.5851 98.5056
frequency: 53.8516 77.5838 98.5038 123.4655 148.5175 188.3064 227.2684 258.9003 265.5693 298.2974 305.8271 338.5329 362.8741 392.8535 406.6062 426.6911 444.4916 466.9402 491.8398 513.3950 527.5229 534.5603 554.1212 561.2141 596.9609 606.0254 617.2923 632.5163 644.2359 648.3270 706.1541 732.1995 747.7964 751.9322 761.6725 766.7397 772.3920 798.0113 819.5169 827.1361 844.6305 844.7759 862.0374 882.3078 907.8225 910.3902 925.1491 931.8672 954.6442 974.3027 976.0026 985.4219 988.3058 995.7601 1010.3901 1036.4450 1053.4467 1074.5234 1090.0953 1123.4542 1125.7032 1159.3764 1175.1027 1181.2414 1188.6096 1198.7823 1211.5721 1240.4647 1252.4049 1275.9974 1287.5434 1306.5646 1318.7318 1347.9926 1378.4746 1386.5528 1396.1352 1406.2768 1411.7245 1423.9153 1430.5034 1435.9158 1469.4111 1475.3512 1482.3501 1493.2175 1533.0361 1567.7716 1576.3766 1586.3320 1606.9347 1612.0918 1621.3314 1633.8671 3120.1741 3121.3466 3123.4715 3126.6633 3129.9911 3134.7763 3143.0040 3146.5030 3148.3996 3155.6400 3160.9327 3168.0843 3171.0613 3179.7494
redmass: 5.0523 4.0071 4.9447 4.3161 4.8161 3.9222 4.4846 4.7902 4.5295 4.6639 6.3995 5.0970 5.4624 5.4929 4.6350 4.8722 3.8016 4.7124 3.4587 3.4749 4.7264 5.2434 5.5167 3.2824 3.2111 6.1122 6.7906 6.1174 4.4531 6.1937 2.7248 5.4067 2.6168 4.5120 1.5448 1.2737 2.1992 2.3434 2.3330 5.3405 2.3465 4.2782 1.6047 1.4073 1.5093 6.0750 1.7301 5.6966 1.4056 1.3932 1.3524 1.3436 1.4256 5.6666 1.3845 2.1695 2.3687 2.9239 2.1697 2.3030 1.8071 1.3445 1.0961 1.1448 1.5963 1.2682 1.4085 1.7544 1.7627 1.7253 2.6450 1.9716 2.8981 3.5093 5.5733 6.2996 2.8245 2.3824 5.7661 3.3482 2.9853 2.5847 3.6129 3.2951 3.4562 3.2087 5.0116 6.7713 6.3974 6.3531 6.1553 5.8941 6.8030 6.9264 1.0887 1.0862 1.0889 1.0865 1.0855 1.0895 1.0915 1.0980 1.0919 1.0957 1.0976 1.0961 1.0967 1.0954
irintensity: 0.0770 0.2501 2.5163 0.3673 0.6417 2.0774 0.2955 0.9768 1.5038 0.6094 1.3391 0.0168 0.3546 0.6204 0.6125 0.0985 2.0300 1.6767 3.1364 0.1710 1.0938 1.0087 2.9299 1.9745 30.8334 0.0620 7.7181 0.7524 0.6889 2.6088 0.1640 0.7663 9.7680 3.0267 86.5505 28.5523 42.0414 23.9010 0.7575 0.1118 20.9280 5.1421 9.7737 8.8361 0.3823 1.2918 48.5127 2.0645 5.4674 3.7798 1.3041 1.6102 0.4556 0.1291 2.9919 7.3804 4.4385 2.5524 5.1410 3.1270 0.2953 6.0526 2.4394 1.4500 8.4413 5.7934 3.4486 0.3676 0.9559 0.7982 2.4776 3.4933 1.9216 8.6230 4.2602 0.7718 3.9797 4.2514 0.3991 5.0806 7.8154 5.6631 3.0989 11.2824 5.5900 4.6724 1.9457 1.5515 0.5990 0.8474 3.8646 1.7836 1.7662 3.0091 0.6567 0.1860 9.5006 2.5500 1.9534 11.4889 23.3026 49.5792 8.9907 38.6884 16.5882 12.9539 45.3331 20.7800
temp: 298.150 k
press: 1.00000 atm
elementType: 6 6 6 6 6 6 6 6 6 6 6 6 6 6 6 6 6 6 6 6 6 6 6 6 1 1 1 1 1 1 1 1 1 1 1 1 1 1
symmnumber: 1
zpe: 778146.1 jmol-1
zpe.correction: 0.296380 hartree
zpe.thermalcorrener: 0.312084 hartree
zpe.thermalcorrenthalpy: 0.313028 hartree
zpe.thermalcorrgfe: 0.254272 hartree
zpe.sumelectzpe: -921.465625 hartree
zpe.sumelectthermal: -921.449922 hartree
zpe.sumelectthermalent: -921.448978 hartree
zpe.sumelectthermalfe: -921.507734 hartree
dipole: -0.0359 0.0060 0.0488
dipole: 0.0609
quadrupole: -116.1992 -116.6989 -146.2190
quadrupole: -0.5194 -1.3804 1.7168
quadrupole: 10.1732 9.6734 -19.8466 -0.5194 -1.3804 1.7168
hfenergy: -921.7620056 hartree
pointgroup: C01 [X(C24H14)]
dipole: 0.0141474 0.001798 -0.0192372 debye
polarizability: 438.6371926|-7.9352191|340.5635388|-8.7219256|-9.6311883|104.8252764 unknown
InChI: InChI=1S/C24H14/c1-2-8-18-16(6-1)14-17-13-12-15-7-5-11-20-19-9-3-4-10-21(19)24(18)23(17)22(15)20/h1-14H
charge 0 multiplicity 1
38 atoms
C  0.143987 -0.909711 0.125995
C  -0.671055 0.264554 0.04735
C  1.585555 -0.825606 -0.010785
C  2.22755 0.444059 -0.217174
C  0.00069 1.572951 0.13021
C  -0.469159 -2.216723 0.310739
C  1.425187 1.667757 -0.075332
C  -2.110286 0.104764 -0.098258
C  2.379995 -2.031793 0.00404
C  -2.704705 -1.199243 0.151746
C  -1.866004 -2.321639 0.396002
C  0.37115 -3.395052 0.400036
C  1.736022 -3.308888 0.242344
C  3.626273 0.468974 -0.472616
C  -0.698959 2.76185 0.514531
C  3.777517 -1.956957 -0.226515
C  2.041596 2.954847 -0.043189
C  -2.991516 1.139036 -0.572289
C  4.39074 -0.714798 -0.480323
C  -4.131484 -1.359869 0.0888
C  -0.065553 4.010905 0.566797
C  1.31248 4.116265 0.244274
C  -4.371859 0.943348 -0.667804
C  -4.958512 -0.305613 -0.292045
H  -2.324911 -3.298939 0.590133
H  -0.113766 -4.363198 0.570611
H  2.3636 -4.206717 0.282853
H  4.134631 1.41812 -0.662153
H  -1.739727 2.68757 0.835464
H  4.371547 -2.878111 -0.217076
H  3.118685 3.044018 -0.209295
H  -2.568949 2.080868 -0.929509
H  5.466841 -0.664097 -0.677793
H  -4.555483 -2.345526 0.314879
H  -0.629089 4.896968 0.878355
H  1.813944 5.089793 0.266655
H  -5.007928 1.747257 -1.05435
H  -6.044146 -0.439926 -0.347013
