program: Gaussian 09
title: 000149785
version: EM64L-G09RevD.01
frameworkgroup: C1[X(C13H13N3)]
method: RPBEPBE
basis: SDD
operation: Freq
keyword: #pfreq=noraman
keyword: PBEPBE/SDD
title: #p freq=noraman PBEPBE/SDD
converged: YES YES NO NO
title: Mulliken charges:
elementType: N N N C C C C C C C C C C C C C H H H H H H H H H H H H H
charge: -0.444124 -0.030780 -0.646775 0.220314 0.183363 -0.098471 0.244982 0.381536 -0.495497 -0.564589 -0.006838 -0.402962 -0.365568 -0.256955 -0.220714 -0.677550 0.244314 0.309887 0.193500 0.223347 0.230642 0.232453 0.220124 0.220500 0.230410 0.217082 0.218122 0.320455 0.319794
chargesum: 0.00000
title: Mulliken charges with hydrogens summed into heavy atoms:
elementType: N N N C C C C C C C C C C C C C
charge: -0.134238 -0.030780 -0.006526 0.220314 0.183363 -0.098471 0.244982 0.381536 -0.251183 -0.147742 -0.006838 -0.172320 -0.133115 -0.036832 -0.000214 -0.011937
polarizability: 2.93612625e+02 -1.30950086e+01 1.59435784e+02 6.43752457e+00 5.97226091e+00 7.60212191e+01
1716.lowfreq: -9.0607 -0.0006 -0.0003 0.0004 6.1838 10.0157 65.0114 74.9623 100.5999
frequency: 64.9719 74.9504 100.5978 161.7730 173.2982 206.6016 218.1150 267.9249 293.1220 322.6315 350.7215 360.9979 380.6047 418.3101 447.3968 450.2270 502.6182 530.8768 535.2954 557.3997 574.9390 594.9097 628.9829 690.5747 711.6525 749.2393 751.7127 757.6468 786.1299 792.0839 804.4917 854.4900 859.0309 916.6192 930.2240 957.0766 968.8378 970.7833 1015.7553 1044.4935 1057.9004 1066.3273 1105.8336 1162.2359 1172.8209 1211.3508 1230.6250 1236.4823 1249.5287 1284.5763 1310.5376 1333.5009 1359.9181 1388.3495 1397.9491 1406.1969 1428.8606 1461.8362 1472.6287 1477.0927 1480.7250 1490.5636 1503.8247 1561.0446 1584.5005 1611.3133 1622.1512 1638.5267 2956.0268 2980.0318 3024.9206 3074.9161 3083.7744 3124.0749 3126.8091 3132.2252 3145.4986 3163.1633 3563.0436 3610.1658 3718.5786
redmass: 3.3914 3.3464 4.1100 3.3261 2.5509 1.3554 5.1805 4.0496 1.2842 2.0751 4.9897 3.7180 4.4594 3.6960 2.2758 3.0958 1.9462 1.9596 1.3167 4.0709 3.8876 6.0614 5.1745 6.6957 5.2499 1.4145 3.5496 4.6180 3.4659 1.6586 3.3788 1.4733 4.4565 1.4451 1.4054 2.0738 1.3063 3.9241 2.0083 1.9092 1.9519 1.6775 1.8370 1.3873 1.6055 2.6915 1.4649 1.4334 2.3935 1.7881 1.4385 1.8977 4.1498 1.3951 3.2230 3.1639 4.2614 3.0058 1.0757 2.3085 1.5275 1.2861 2.3965 6.5702 6.5018 1.4844 4.0747 8.1565 1.0659 1.0356 1.0951 1.0999 1.1004 1.0850 1.0918 1.0893 1.0951 1.1002 1.0448 1.0803 1.1040
irintensity: 1.7846 0.1541 1.2985 1.3329 1.8704 0.4076 0.4661 0.1180 165.3839 25.7230 2.0704 3.7936 5.0456 0.8211 21.8065 16.3733 15.7576 8.2969 148.7911 12.3611 0.1782 12.5687 0.8404 1.9268 12.4013 80.9567 2.0778 0.2237 21.6580 6.2248 5.1433 0.0108 0.0951 16.1480 2.3378 11.8664 0.0141 1.1439 7.1559 11.4375 25.5789 1.0408 4.0598 6.6124 1.1749 0.6524 3.5556 0.1811 123.8883 7.3747 1.5904 76.2506 15.7925 13.5256 24.4221 4.8740 239.7377 117.9984 2.7677 26.9273 32.9942 6.6781 7.4488 51.9159 16.5652 98.9640 367.6694 91.8162 54.7900 48.8270 10.9308 56.2506 33.6840 0.4548 11.8588 3.9484 35.9294 37.5497 107.4004 57.5238 32.0975
temp: 298.150 k
press: 1.00000 atm
elementType: 7 7 7 6 6 6 6 6 6 6 6 6 6 6 6 6 1 1 1 1 1 1 1 1 1 1 1 1 1
symmnumber: 1
zpe: 614812.0 jmol-1
zpe.correction: 0.234170 hartree
zpe.thermalcorrener: 0.247527 hartree
zpe.thermalcorrenthalpy: 0.248471 hartree
zpe.thermalcorrgfe: 0.194890 hartree
zpe.sumelectzpe: -666.359188 hartree
zpe.sumelectthermal: -666.345831 hartree
zpe.sumelectthermalent: -666.344887 hartree
zpe.sumelectthermalfe: -666.398468 hartree
dipole: -2.3160 0.2709 -0.0921
dipole: 2.3336
quadrupole: -74.4136 -82.3666 -100.5014
quadrupole: 2.2370 2.3672 1.7128
quadrupole: 11.3470 3.3939 -14.7408 2.2370 2.3672 1.7128
hfenergy: -666.5933578 hartree
pointgroup: C01 [X(C13H13N3)]
dipole: -0.9140272 -0.0852735 0.0147031 debye
polarizability: 294.3288376|9.7997522|158.1874693|-1.5971152|9.8545265|76.5533214 unknown
InChI: InChI=1S/C13H13N3/c1-2-8-7-10-9-5-3-4-6-11(9)15-13(10)16-12(8)14/h3-7,15H,2,14H2,1H3
charge 0 multiplicity 1
29 atoms
N  1.101267 -1.735931 -0.23236
N  -1.334064 -1.693375 -0.124091
N  -3.650953 -1.507391 0.003748
C  0.113096 0.316021 0.117531
C  1.555395 0.50735 0.090853
C  -0.12822 -1.084856 -0.084904
C  2.141527 -0.79234 -0.130079
C  -2.317653 0.557783 0.250421
C  -1.030276 1.13138 0.288944
C  -3.566528 1.415107 0.387615
C  -2.416713 -0.870272 0.042385
C  2.40521 1.630402 0.228199
C  3.535219 -0.9799 -0.214272
C  3.803251 1.449345 0.14525
C  4.360712 0.159089 -0.073554
C  -4.268298 1.703893 -0.969388
H  -0.9318 2.211474 0.451385
H  1.201887 -2.736852 -0.386117
H  -4.290313 0.944249 1.08627
H  -3.290509 2.379572 0.853938
H  1.987044 2.629283 0.396912
H  3.970981 -1.970873 -0.38267
H  4.470433 2.311868 0.250334
H  5.448883 0.04501 -0.134022
H  -3.593656 2.267959 -1.637475
H  -5.186535 2.302004 -0.821769
H  -4.544647 0.771168 -1.494266
H  -3.657689 -2.516799 -0.120099
H  -4.52165 -1.005367 0.138282
