program: Gaussian 09
title: 000149768
version: EM64L-G09RevD.01
frameworkgroup: C1[X(C7H9NO3)]
method: RPBEPBE
basis: SDD
operation: Freq
keyword: #pfreq=noraman
keyword: PBEPBE/SDD
title: #p freq=noraman PBEPBE/SDD
converged: YES YES NO NO
title: Mulliken charges:
elementType: O O O N C C C C C C C H H H H H H H H H
charge: -0.441495 -0.490865 -0.478335 -0.537442 0.557547 -0.561293 -0.590136 -0.521859 0.225590 0.255828 -0.023961 0.222237 0.211605 0.228250 0.252971 0.273006 0.264474 0.384010 0.372951 0.396916
chargesum: 0.00000
title: Mulliken charges with hydrogens summed into heavy atoms:
elementType: O O O N C C C C C C C
charge: -0.057484 -0.117914 -0.081419 0.000038 0.557547 -0.127451 -0.361886 -0.268887 0.225590 0.255828 -0.023961
polarizability: 1.25894108e+02 1.25496157e-01 1.07777584e+02 4.11194488e+00 -4.26995295e-02 5.02198243e+01
1716.lowfreq: -4.1018 0.0004 0.0005 0.0009 7.1799 12.0718 31.9026 101.9083 159.2698
frequency: 31.7601 101.9029 159.2693 203.7989 241.4792 249.3599 258.0610 273.8528 284.1228 315.1655 372.9839 413.5945 467.0224 480.3035 494.3464 558.6274 561.5149 592.9840 626.3898 686.6642 710.1734 765.3643 813.5480 857.6181 866.7862 956.2436 982.2298 1067.1471 1095.2736 1122.8879 1140.1680 1170.8346 1213.9147 1237.4536 1282.3701 1327.2141 1330.2784 1359.4635 1418.6117 1454.2462 1466.6556 1523.3301 1622.8642 1636.7666 1648.7708 2994.9974 3053.3260 3114.7540 3150.5293 3440.3692 3528.0126 3565.4346 3568.4192 3624.5428
redmass: 2.5156 5.0508 8.0320 1.5930 4.2480 1.6202 4.0531 2.0803 4.6358 1.6975 5.1205 1.1221 5.0808 1.1026 4.7196 5.9009 4.7714 4.2283 1.8423 3.5739 3.0236 4.0658 1.6759 1.4847 1.3399 5.1021 4.1471 4.0541 2.1494 1.2106 1.3937 1.3884 1.4153 2.3406 1.9847 1.3223 1.2462 2.5166 4.9586 1.1783 2.8069 3.7182 6.9572 7.1754 1.0889 1.0606 1.1039 1.0911 1.0920 1.0449 1.0651 1.0968 1.0654 1.0666
irintensity: 1.8807 0.2620 0.6123 30.7406 11.3768 126.6168 10.8701 40.6613 9.0464 30.8255 1.4588 192.1031 2.4905 131.8007 5.2937 1.6367 0.4591 26.5705 190.9944 225.0136 26.5885 7.6205 26.9449 18.9317 8.4178 0.1965 185.8319 18.8423 84.5736 3.4412 29.3724 133.9000 94.0541 121.5120 219.9528 3.9267 5.2210 53.3687 1.8564 12.1389 15.1895 85.0642 70.6571 39.9678 32.8825 48.6352 22.7907 11.5119 3.0926 2.9692 73.0510 0.5875 90.8441 52.5024
temp: 298.150 k
press: 1.00000 atm
elementType: 8 8 8 7 6 6 6 6 6 6 6 1 1 1 1 1 1 1 1 1
symmnumber: 1
zpe: 403642.8 jmol-1
zpe.correction: 0.153739 hartree
zpe.thermalcorrener: 0.164959 hartree
zpe.thermalcorrenthalpy: 0.165903 hartree
zpe.thermalcorrgfe: 0.116933 hartree
zpe.sumelectzpe: -551.719489 hartree
zpe.sumelectthermal: -551.708269 hartree
zpe.sumelectthermalent: -551.707325 hartree
zpe.sumelectthermalfe: -551.756295 hartree
dipole: 1.0877 -3.1440 0.5039
dipole: 3.3648
quadrupole: -69.2271 -56.3964 -65.5565
quadrupole: -2.9635 -0.0697 0.4961
quadrupole: -5.5004 7.3303 -1.8298 -2.9635 -0.0697 0.4961
hfenergy: -551.873228 hartree
pointgroup: C01 [X(C7H9N1O3)]
dipole: 0.3672394 1.2668251 -0.1130209 debye
dipolederiv: -0.568505 0.5914823 0.0346458 0.6170208 -0.9949888 -0.0887382 0.0452066 -0.0988067 -0.4255109 -0.5070586 -0.5720901 -0.0406644 -0.553162 -1.08313 0.0230553 -0.0231221 0.0427593 -0.4307475 -1.4310622 -0.0736446 0.096234 -0.0639507 -0.1673371 0.0228655 0.1364967 0.0247004 -0.4246793 -1.1801139 -0.0237912 -0.1212718 -0.0056771 -0.1766957 -0.0504233 -0.1541215 -0.0570652 -0.420213 0.0162053 -0.0137022 -0.045113 0.0221738 0.1766719 -0.0101878 0.0898819 0.0093789 -0.1153406 0.6719004 0.0088041 0.0581778 0.0043024 0.2106208 0.0623513 0.0542313 0.0502836 0.4285497 -0.3142406 -0.1401502 -0.0219921 -0.0509339 -0.1831402 0.0089735 -0.0115432 0.0212787 -0.2329931 -0.3058229 0.182916 -0.0106114 0.0793689 -0.1123116 0.0010072 0.0089407 -0.0220421 -0.219701 0.4844717 -0.4466711 -0.0497024 -0.6677487 0.996394 0.1120519 -0.0762926 0.0969705 0.1085118 0.3244399 0.3558759 -0.0063991 0.5270412 1.0492863 0.003396 0.007473 0.0120124 0.07875 1.0943469 0.0817453 -0.1283197 0.1078858 -0.465208 -0.0435142 -0.1495788 -0.0358576 -0.0205954 -0.0265469 -0.0252818 0.0115976 -0.0792055 -0.0304931 0.141413 0.0189692 0.0742297 -0.031716 0.0003686 0.0132349 -0.0096324 0.0752647 -0.1136142 -0.1339488 -0.0011403 -0.0674939 0.020874 0.0507206 0.0767642 0.0273759 0.0554829 -0.0834109 -0.023705 0.0131439 -0.0266468 0.1667232 0.060481 -0.0810685 0.0160737 -0.0664726 -0.020556 -0.0004803 0.0151463 -0.0010134 0.1620693 0.3824698 0.1555946 0.0369917 0.0766803 0.0447368 -0.059681 -0.0273683 -0.0502019 0.1113085 0.3537516 -0.1314659 0.0994473 -0.0976479 0.109688 0.0562524 0.0167529 0.0576666 0.0521213 0.2469296 -0.1455291 0.0122801 -0.134248 0.3450066 0.0115949 0.007638 0.0159138 0.3901446 0.1892804 0.1687306 0.0427548 0.1262045 0.3220097 -0.0187396 0.0361182 -0.0302992 0.3939383 0.4579843 0.0182469 -0.0018725 0.0276212 0.1764715 -0.0135426 -0.0068318 -0.015767 0.408506 unknown
polarizability: 125.9125502|1.0104904|107.5937728|-3.5484468|3.5307938|50.3851931 unknown
InChI: InChI=1S/C7H9NO3/c8-3-4-1-5(9)7(11)6(10)2-4/h1-2,9-11H,3,8H2
charge 0 multiplicity 1
20 atoms
O  1.471329 -2.385732 -0.170379
O  1.636526 2.403043 0.046336
O  2.886373 -0.026443 -0.245015
N  -3.597633 -0.184409 -0.814214
C  -1.315064 0.05055 0.301385
C  -2.842018 0.052799 0.440556
C  -0.598556 1.275542 0.275056
C  -0.616535 -1.174351 0.154247
C  0.780594 -1.178059 -0.029431
C  0.800331 1.260782 0.090564
C  1.491614 0.044036 -0.063157
H  -3.153519 -0.724415 1.162729
H  -3.173561 1.022535 0.856752
H  -1.132722 2.226435 0.401282
H  -1.142769 -2.134119 0.187143
H  -3.488198 -1.136569 -1.18087
H  -3.398905 0.510734 -1.542801
H  2.440041 -2.193023 -0.278177
H  1.122642 3.235473 0.17417
H  3.26473 0.889491 -0.239273
