program: Gaussian 09
title: 000149782
version: EM64L-G09RevD.01
frameworkgroup: C1[X(C16H12O5)]
method: RPBEPBE
basis: SDD
operation: Freq
keyword: #pfreq=noraman
keyword: PBEPBE/SDD
title: #p freq=noraman PBEPBE/SDD
converged: NO YES NO NO
title: Mulliken charges:
elementType: O O O O O C C C C C C C C C C C C C C C C H H H H H H H H H H H H
charge: -0.365843 -0.440063 -0.341598 -0.168439 -0.206906 0.132191 0.387022 0.250920 0.269313 0.048827 0.106883 -0.171873 -0.224879 -0.665104 0.186311 -0.396139 -0.379433 -0.374886 -0.227574 -0.231655 -0.480137 0.287356 0.228439 0.266792 0.292561 0.287193 0.237304 0.237696 0.394776 0.373684 0.244606 0.225331 0.217328
chargesum: 0.00000
title: Mulliken charges with hydrogens summed into heavy atoms:
elementType: O O O O O C C C C C C C C C C C C C C C C
charge: 0.028933 -0.066379 -0.341598 -0.168439 -0.206906 0.132191 0.387022 0.250920 0.269313 0.048827 0.106883 -0.171873 -0.224879 -0.377749 0.186311 0.099091 -0.086872 -0.087693 0.009729 0.006041 0.207127
polarizability: 3.21898361e+02 -1.27597374e+01 2.23234917e+02 -5.08377451e+00 -3.25181829e+00 8.17015428e+01
1716.lowfreq: -0.0005 -0.0005 -0.0004 3.3986 6.4185 8.9920 29.9855 47.7671 62.9137
frequency: 29.9569 47.7640 62.9102 85.5478 93.8589 119.5494 142.9870 159.8148 195.8200 198.8424 214.9731 258.7203 270.3944 280.1688 300.2189 333.1619 349.5686 373.8603 395.4636 402.3042 423.3803 436.7791 447.5715 467.4456 498.4853 544.0708 566.2224 591.1061 619.1442 637.0425 676.2111 688.1108 717.2252 727.9659 757.8030 785.8956 810.8116 851.4048 857.1732 868.7062 892.5675 895.6868 943.7431 960.9795 997.4724 997.9187 1015.1317 1030.2671 1039.6139 1043.0595 1059.4697 1096.2135 1122.3210 1153.5873 1167.0138 1170.2454 1184.8586 1193.2828 1221.0799 1241.6279 1275.0430 1282.1091 1331.2708 1357.2063 1370.8145 1397.6833 1409.4437 1433.2965 1439.3252 1456.2274 1460.8074 1465.2133 1469.0755 1476.5057 1510.9308 1535.7980 1543.8908 1587.0023 1600.9669 1612.8396 1621.0456 2930.0048 2954.6880 3001.0281 3047.6168 3049.8288 3124.9759 3132.4469 3134.1076 3149.9025 3161.7613 3170.4887 3588.7575
redmass: 6.3782 5.4601 5.3225 2.1068 4.0467 4.7417 5.2887 7.0250 2.9763 3.1023 1.8776 5.3866 4.4148 6.3264 5.8390 5.3627 6.4228 9.4777 5.4773 1.2451 3.8552 6.2840 4.8660 9.8757 7.6416 6.6012 5.3957 7.3048 5.3963 5.8852 5.4393 4.6176 7.5211 2.5784 3.5441 5.6760 1.9655 2.9493 2.0887 1.7193 2.2101 2.0298 2.2857 3.5638 2.8855 1.4254 1.3637 2.4388 5.8748 2.7402 6.2760 2.0913 1.2651 1.4276 1.1982 1.2440 1.7399 1.7175 1.6739 1.6369 2.3193 3.9991 4.2908 2.2879 2.3673 8.1054 4.2086 1.3073 2.5343 3.0626 1.0804 1.1202 2.6713 1.1023 1.9283 9.4988 7.6340 7.2588 5.4576 7.6296 5.7319 1.0667 1.0351 1.0667 1.0988 1.0974 1.1003 1.0917 1.0862 1.0902 1.0944 1.1001 1.0661
irintensity: 5.8873 2.3813 1.1239 6.8500 2.2129 0.3997 5.3703 2.1434 0.3127 0.2966 7.8327 1.6498 6.1533 4.1166 0.7606 5.2458 2.8596 7.9087 44.5878 119.5901 0.6030 2.6183 0.8689 1.1517 0.8534 10.9437 1.5236 12.1734 3.4436 4.4331 0.4046 6.3467 7.0781 62.9312 31.8066 9.5515 10.4112 54.8645 4.6420 80.9494 24.7389 6.5488 1.7613 11.7992 75.9101 7.4717 0.1559 37.9650 174.8312 90.8113 67.2264 51.2757 2.8514 24.9628 0.4679 80.5944 39.8515 41.9952 24.8367 48.6279 2.1834 276.5948 529.4985 13.8906 48.3017 6.4613 16.3422 3.1695 13.8279 17.9697 12.6318 3.0921 7.1551 13.8172 8.7074 16.1436 451.3613 21.7028 52.9520 25.3259 99.7031 58.6797 306.7472 830.7142 48.0168 3.7979 16.7251 7.8197 4.5673 7.9081 1.7842 33.7633 67.5221
temp: 298.150 k
press: 1.00000 atm
elementType: 8 8 8 8 8 6 6 6 6 6 6 6 6 6 6 6 6 6 6 6 6 1 1 1 1 1 1 1 1 1 1 1 1
symmnumber: 1
zpe: 638786.0 jmol-1
zpe.correction: 0.243301 hartree
zpe.thermalcorrener: 0.261066 hartree
zpe.thermalcorrenthalpy: 0.262011 hartree
zpe.thermalcorrgfe: 0.197252 hartree
zpe.sumelectzpe: -991.547254 hartree
zpe.sumelectthermal: -991.529488 hartree
zpe.sumelectthermalent: -991.528544 hartree
zpe.sumelectthermalfe: -991.593303 hartree
dipole: -4.1856 1.8496 0.2130
dipole: 4.5810
quadrupole: -74.7896 -123.2165 -123.4566
quadrupole: -4.7272 -2.3002 0.9227
quadrupole: 32.3646 -16.0623 -16.3024 -4.7272 -2.3002 0.9227
hfenergy: -991.7905547 hartree
pointgroup: C01 [X(C16H12O5)]
dipole: 1.6733361 -0.6472678 0.170996 debye
polarizability: 322.6791351|-8.0891922|221.2203007|7.3142045|-13.2211182|82.9353849 unknown
InChI: InChI=1S/C16H12O5/c1-21-7-11-12(17)6-10-13(16(11)20)15(19)9-5-3-2-4-8(9)14(10)18/h2-6,17,20H,7H2,1H3
charge 0 multiplicity 1
33 atoms
O  1.931391 2.007812 -0.099551
O  3.292511 -2.584986 0.403259
O  4.326995 1.264575 -0.593781
O  -0.707467 2.569503 -0.094429
O  -1.775834 -2.840502 0.217265
C  0.19238 0.309516 0.035389
C  -0.117368 -1.086508 0.134706
C  -2.317612 0.79248 -0.100608
C  -2.621415 -0.594302 -0.011087
C  1.580605 0.684443 0.028517
C  2.611136 -0.30136 0.160954
C  -0.901391 1.313426 -0.056612
C  -1.530714 -1.593782 0.12226
C  0.894175 -2.059321 0.239004
C  2.244611 -1.66056 0.261258
C  4.071833 0.085108 0.270461
C  -3.374975 1.726577 -0.224576
C  -3.970123 -1.032377 -0.046131
C  -4.71349 1.287573 -0.262726
C  -5.01364 -0.096473 -0.172894
C  5.708248 1.749394 -0.507394
H  0.589755 -3.110188 0.3112
H  4.329937 0.35709 1.318909
H  4.717036 -0.753866 -0.044658
H  -3.115054 2.787818 -0.287537
H  -4.166124 -2.106709 0.027782
H  -5.525138 2.016626 -0.361388
H  -6.055022 -0.434454 -0.201704
H  2.930014 2.050394 -0.314174
H  2.942632 -3.509314 0.441705
H  5.769788 2.624585 -1.171107
H  6.409441 0.966997 -0.855481
H  5.964378 2.043383 0.530471
