program: Gaussian 09
title: 000149789
version: EM64L-G09RevD.01
frameworkgroup: C1[X(C18H15N3)]
method: RPBEPBE
basis: SDD
operation: Freq
keyword: #pfreq=noraman
keyword: PBEPBE/SDD
title: #p freq=noraman PBEPBE/SDD
converged: YES YES NO NO
title: Mulliken charges:
elementType: N N N C C C C C C C C C C C C C C C C C C H H H H H H H H H H H H H H H
charge: -0.441782 -0.029147 -0.636071 0.217729 0.183457 -0.108117 0.378035 0.246808 -0.516998 -0.723584 -0.007218 -0.404283 0.453113 -0.366844 -0.257298 -0.220904 -0.454523 -0.369632 -0.224019 -0.224090 -0.246750 0.246587 0.229903 0.233629 0.310697 0.230926 0.232861 0.220514 0.220940 0.240693 0.248563 0.314031 0.337720 0.227617 0.227580 0.229859
chargesum: 0.00000
title: Mulliken charges with hydrogens summed into heavy atoms:
elementType: N N N C C C C C C C C C C C C C C C C C C
charge: -0.131085 -0.029147 0.015680 0.217729 0.183457 -0.108117 0.378035 0.246808 -0.270412 -0.260053 -0.007218 -0.173356 0.453113 -0.133982 -0.036785 0.000036 -0.213830 -0.121068 0.003598 0.003490 -0.016891
polarizability: 3.75651265e+02 3.86748302e+01 1.76658157e+02 -1.67155249e+01 6.96141110e+00 1.40252496e+02
1716.lowfreq: -4.1318 0.0004 0.0006 0.0009 1.3507 3.4332 26.8784 33.8047 48.4815
frequency: 26.8477 33.7589 48.4428 91.1073 101.3725 150.2283 205.2967 215.0690 224.9328 258.8024 304.0007 342.5369 358.9973 363.1962 403.3075 421.0505 437.9440 449.2449 462.8087 466.3828 528.2483 531.7271 540.6131 551.5197 574.5249 587.2696 603.9624 615.7564 652.3387 695.4926 702.9963 715.5731 741.0905 747.4265 754.6907 766.5956 784.3857 805.7397 827.6274 854.5591 858.7430 863.2891 902.6255 923.9771 930.1848 948.8980 968.8615 978.3619 980.7104 989.8280 998.8814 1016.4929 1025.5494 1065.2134 1080.6701 1104.7439 1156.5981 1168.0473 1171.6615 1180.7299 1186.7086 1202.9654 1215.0803 1232.2683 1248.3813 1272.9070 1295.5503 1332.4531 1336.3638 1360.2758 1380.8415 1397.0348 1406.8439 1430.6792 1439.6539 1454.3065 1465.7410 1478.4597 1481.5789 1499.1728 1558.6264 1584.4161 1590.8421 1611.3106 1614.2985 1623.2167 1638.7917 2961.9189 3014.6412 3110.5443 3122.9580 3124.0156 3125.3650 3132.0854 3134.5476 3145.4088 3145.4399 3163.0147 3163.2405 3525.2051 3609.2247 3675.1654
redmass: 5.2242 3.8405 4.8713 5.3883 4.6893 4.7511 4.2957 4.8461 5.6716 4.9173 2.1968 5.4462 4.1606 4.7583 2.8106 3.3320 2.7798 3.1831 1.7726 1.8305 1.3107 4.2692 1.2340 3.5444 3.8747 5.7614 6.0813 6.2552 5.6089 6.9277 2.5944 2.9844 2.0544 1.5323 3.6322 3.8989 4.5567 3.7690 4.6095 1.4791 1.2459 3.9094 1.5146 1.4641 1.4147 1.9635 1.3069 3.2768 1.4072 5.8638 1.3263 1.9934 2.2233 2.0534 1.5936 1.9148 2.1511 1.2179 1.0675 1.2468 1.1144 2.5581 2.3631 1.5720 2.4700 1.7581 1.5720 1.6962 1.4237 4.2966 7.1410 5.0128 3.1238 4.2952 2.0900 1.3121 3.1352 3.5473 2.1754 4.4856 6.5897 6.5657 6.0279 5.8186 1.7287 2.8894 8.0620 1.0609 1.0988 1.0877 1.0860 1.0861 1.0908 1.0893 1.0909 1.0957 1.0953 1.1013 1.1003 1.0449 1.0803 1.1041
irintensity: 0.1201 0.1167 0.2420 2.6425 0.3328 0.1207 4.7792 0.6719 0.4404 1.5330 0.3105 1.5680 4.1357 0.4551 0.9782 8.1171 14.6273 3.4294 72.5212 77.0325 22.6099 2.9634 218.5923 18.2994 0.2406 3.3175 13.3959 0.6789 7.4416 6.4716 24.1035 38.8203 39.8632 68.1089 14.6285 7.9682 21.2079 11.8234 0.6562 0.0188 0.1335 0.9713 21.6028 8.4987 1.6636 17.5715 0.0188 0.0358 0.0440 0.8448 0.5531 9.8275 11.5001 5.1150 12.6613 3.9141 9.9336 6.3247 0.4119 9.1596 4.0155 0.3487 1.4449 4.8951 115.0871 14.9530 8.7365 52.3277 22.4019 19.5622 0.5147 19.0898 3.5273 242.1452 17.7835 12.3886 184.5340 8.7352 15.9448 3.1374 50.8266 21.7735 1.0963 7.4387 27.7045 347.2855 112.7656 32.7513 9.0879 8.9614 1.9850 0.4349 10.6446 3.7219 9.4798 45.6936 27.4879 43.7239 25.7621 142.4571 58.3343 74.3976
temp: 298.150 k
press: 1.00000 atm
elementType: 7 7 7 6 6 6 6 6 6 6 6 6 6 6 6 6 6 6 6 6 6 1 1 1 1 1 1 1 1 1 1 1 1 1 1 1
symmnumber: 1
zpe: 752170.4 jmol-1
zpe.correction: 0.286487 hartree
zpe.thermalcorrener: 0.302777 hartree
zpe.thermalcorrenthalpy: 0.303722 hartree
zpe.thermalcorrgfe: 0.241822 hartree
zpe.sumelectzpe: -857.781807 hartree
zpe.sumelectthermal: -857.765517 hartree
zpe.sumelectthermalent: -857.764572 hartree
zpe.sumelectthermalfe: -857.826472 hartree
dipole: 2.0475 0.4112 0.2806
dipole: 2.1072
quadrupole: -104.4016 -115.3082 -120.7114
quadrupole: 0.5719 -3.8695 3.7525
quadrupole: 9.0721 -1.8345 -7.2376 0.5719 -3.8695 3.7525
hfenergy: -858.0682939 hartree
pointgroup: C01 [X(C18H15N3)]
dipole: -0.8133008 0.1464682 -0.0660523 debye
polarizability: 375.9546853|-31.0813513|175.543827|-28.5685062|-3.0903258|141.063406 unknown
InChI: InChI=1S/C18H15N3/c19-17-13(10-12-6-2-1-3-7-12)11-15-14-8-4-5-9-16(14)20-18(15)21-17/h1-9,11,20H,10,19H2
charge 0 multiplicity 1
36 atoms
N  2.683915 1.773725 -0.509302
N  0.322082 2.067045 0.017221
N  -1.937374 2.20264 0.58921
C  1.565463 -0.070709 0.299784
C  2.945857 -0.454806 0.04636
C  1.442444 1.315113 -0.0568
C  -0.798861 0.038748 0.910193
C  3.615991 0.719077 -0.458047
C  0.398095 -0.696195 0.796793
C  -2.054035 -0.580279 1.507787
C  -0.790786 1.425691 0.494654
C  3.679187 -1.656038 0.191973
C  -3.274816 -0.639462 0.580357
C  4.979506 0.707875 -0.811813
C  5.046609 -1.673954 -0.160119
C  5.688267 -0.505324 -0.656152
C  -4.56937 -0.331836 1.07285
C  -3.141162 -1.031316 -0.777117
C  -5.7053 -0.419326 0.234446
C  -4.272863 -1.120309 -1.616844
C  -5.560312 -0.814972 -1.114649
H  0.412528 -1.747355 1.109431
H  -2.339856 -0.032809 2.429862
H  -1.808617 -1.611824 1.829518
H  2.859824 2.725672 -0.823351
H  3.195271 -2.562666 0.572641
H  5.479781 1.604429 -1.194073
H  5.624113 -2.598484 -0.051465
H  6.750463 -0.545263 -0.922395
H  -4.690019 -0.032562 2.122307
H  -2.143703 -1.257025 -1.17244
H  -1.871458 3.163169 0.257467
H  -2.854052 1.770244 0.684661
H  -6.697735 -0.179769 0.632986
H  -4.152139 -1.425275 -2.662633
H  -6.437836 -0.88267 -1.7673
