program: Gaussian 09
title: 000149709
version: EM64L-G09RevD.01
frameworkgroup: C1[X(C12H6N4O4)]
method: RPBEPBE
basis: SDD
operation: Freq
keyword: #p
keyword: freq=noraman
keyword: PBEPBE/SDD
title: #p freq=noraman PBEPBE/SDD
converged: YES YES NO YES
title: Mulliken charges:
elementType: O O O O N N N N C C C C C C C C C C C C H H H H H H
charge: -0.193676 -0.187232 -0.193677 -0.187234 0.014670 0.026376 0.024116 0.024114 0.102928 0.102927 0.043177 0.043179 -0.481611 -0.481612 -0.291173 -0.291172 0.419609 0.419614 -0.355176 -0.355178 0.322560 0.322560 0.278151 0.278151 0.297805 0.297805
chargesum: 0.00000
title: Mulliken charges with hydrogens summed into heavy atoms:
elementType: O O O O N N N N C C C C C C C C C C C C
charge: -0.193676 -0.187232 -0.193677 -0.187234 0.014670 0.026376 0.024116 0.024114 0.102928 0.102927 0.043177 0.043179 -0.159051 -0.159053 -0.013021 -0.013021 0.419609 0.419614 -0.057371 -0.057373
polarizability: 3.97465941e+02 -4.39373418e-05 1.78833891e+02 8.55744200e-03 6.64644376e-04 6.19254927e+01
1716.lowfreq: -6.2989 -3.4443 -0.0002 0.0006 0.0006 4.3960 42.8646 47.1129 66.3152
frequency: 42.8645 47.1113 66.3007 73.5075 105.5741 156.7227 172.4327 187.7600 250.0384 287.1154 293.2780 322.7053 349.1886 405.4444 426.5456 486.7814 490.2357 503.8418 514.0374 524.5358 533.0487 554.8006 582.3535 605.4606 630.5718 690.7567 705.9883 707.1677 726.7381 756.8537 759.7900 794.9318 805.4127 834.2456 860.5442 864.1188 909.4198 945.9118 949.3154 955.2343 1004.6896 1004.7841 1054.7330 1060.1470 1120.0001 1135.7204 1200.1369 1206.4386 1215.1673 1228.4063 1245.7799 1246.3911 1276.7317 1319.6226 1360.6835 1376.3106 1381.2991 1404.8177 1436.7757 1450.6173 1472.8919 1499.8600 1538.2000 1556.2447 1600.9174 1635.1128 3169.2355 3169.4551 3188.4157 3188.6768 3192.7386 3192.8437
redmass: 12.7125 12.7874 8.9181 6.7810 12.7756 5.3551 7.3283 10.5155 11.4187 7.8751 5.7455 6.9786 10.4095 4.1081 9.1086 2.9295 5.2510 7.0328 7.7778 5.5588 5.4077 9.2998 5.3449 9.9111 8.3971 8.2720 6.4670 5.1804 7.8102 12.6216 3.3609 7.2821 2.4306 4.9574 1.6229 2.0960 5.8892 1.5419 1.5288 4.2122 1.3174 1.3223 2.0770 2.5648 1.4881 1.3330 3.7347 9.0912 2.1981 3.8151 1.7807 9.1824 2.8359 2.3718 3.5377 12.2489 9.6091 5.8483 3.8062 6.3547 3.8683 9.7931 8.7894 9.1000 6.9137 7.5733 1.0896 1.0897 1.0931 1.0932 1.0971 1.0971
irintensity: 0.8631 0.0000 0.0016 0.0000 1.7646 0.0000 10.6782 0.3851 0.2234 6.9360 0.0000 1.0977 0.5806 7.8234 0.3682 0.0000 0.2311 7.3076 0.2754 0.0000 1.3213 11.8792 0.1846 0.3295 0.0036 8.7619 0.0000 53.5746 1.2833 109.2935 0.0000 2.6515 10.8979 8.5519 0.0000 73.8727 2.1797 47.6657 0.0000 3.9498 0.3847 0.0001 3.4112 61.9182 0.7451 32.2337 508.9291 46.3561 193.3370 7.3819 7.2394 15.1464 1.6331 0.0943 4.0113 184.7528 17.4447 0.0253 14.2558 43.4642 0.0522 17.9777 15.4296 0.7223 84.0815 0.0032 9.3479 0.4736 0.1276 13.8045 5.2781 3.3291
temp: 298.150 k
press: 1.00000 atm
elementType: 8 8 8 8 7 7 7 7 6 6 6 6 6 6 6 6 6 6 6 6 1 1 1 1 1 1
symmnumber: 1
zpe: 442693.2 jmol-1
zpe.correction: 0.168613 hartree
zpe.thermalcorrener: 0.183443 hartree
zpe.thermalcorrenthalpy: 0.184387 hartree
zpe.thermalcorrgfe: 0.125301 hartree
zpe.sumelectzpe: -979.243691 hartree
zpe.sumelectthermal: -979.228861 hartree
zpe.sumelectthermalent: -979.227917 hartree
zpe.sumelectthermalfe: -979.287003 hartree
dipole: -0.0001 4.4333 0.0004
dipole: 4.4333
quadrupole: -158.7325 -115.3472 -111.8100
quadrupole: 0.0002 0.0093 -0.0004
quadrupole: -30.1026 13.2827 16.8199 0.0002 0.0093 -0.0004
hfenergy: -979.412304 hartree
pointgroup: C01 [X(C12H6N4O4)]
dipole: 0.0000236 1.7442044 -0.0001434 debye
dipolederiv: -0.9726874 -0.1450357 -0.0000043 -0.0026716 -0.5219715 -0.0000019 0.0001628 0.0001542 -0.2199437 -0.6535239 0.1190659 0.0000349 0.3316702 -0.7754957 0.0002307 0.0000668 -0.0000825 -0.2125781 -0.9726775 0.1450393 -0.0000188 0.0026648 -0.5219694 0.0000325 0.0002406 -0.0001941 -0.2199438 -0.6535217 -0.1190669 0.000057 -0.3316559 -0.7754901 -0.0002717 0.0001143 0.0001605 -0.2125783 0.1777754 -0.0000006 0.0000578 -0.0000004 -0.1787587 -0.0000005 0.0001024 0.0000043 -0.2614771 -0.4672012 -0.0000001 0.0000089 0.0000002 -0.1418882 0.0000008 -0.0000337 -0.0000014 -0.2578582 1.9750659 -0.135573 -0.0000872 -0.5914501 1.153277 -0.0002366 -0.000019 -0.0001592 0.1899233 1.9750459 0.135569 -0.0001321 0.5914412 1.153267 0.0002303 -0.0000724 0.0001457 0.1899209 -0.1370602 0.1092429 -0.0000306 -0.3975993 -0.1013768 -0.0000182 -0.0000362 0.0000122 0.128158 -0.1370608 -0.1092425 -0.0000319 0.3975978 -0.1013767 0.0000169 -0.0000261 -0.0000134 0.1281585 0.439046 -0.058836 0.0000066 0.3562463 -0.0170322 0.000028 0.0000117 0.0000016 0.1309307 0.4390456 0.0588359 0.0000059 -0.3562453 -0.0170318 -0.0000292 0.000012 -0.0000012 0.1309302 0.3620607 -0.1465011 0.0000439 0.0397799 -0.0353179 -0.0000167 -0.0001362 0.0000155 -0.0991461 0.3620611 0.1465004 0.0000447 -0.0397835 -0.03532 0.0000258 -0.0001862 -0.0000296 -0.0991469 -0.3618558 0.0152298 -0.0000052 0.1247188 0.1713756 -0.0000035 -0.0000372 -0.0000064 -0.1335022 -0.3618545 -0.0152288 -0.0000041 -0.124719 0.1713746 0.0000059 -0.0000535 0.0000071 -0.1335017 -0.8017343 0.1244438 0.0000199 0.0285593 0.0695363 0.0000048 -0.0000506 0.0000593 0.070911 -0.8017216 -0.1244408 0.0000497 -0.0285542 0.069538 0.0000064 -0.0000526 -0.0000704 0.070913 -0.0022387 0.1302764 0.0000151 -0.1197358 0.0134266 0.0000129 -0.0000389 0.0000018 -0.1088114 -0.0022434 -0.1302767 0.0000214 0.1197367 0.0134301 -0.0000174 -0.0000674 -0.0000044 -0.1088123 0.1293546 -0.0090815 -0.0000088 0.0026871 0.0929295 0.0000003 0.0000179 -0.0000032 0.178548 0.1293548 0.0090818 -0.0000096 -0.002687 0.0929297 -0.000001 0.0000154 0.0000045 0.1785481 0.0781413 0.0293433 -0.0000031 -0.0300416 -0.010701 -0.0000034 0.0000222 -0.0000011 0.160476 0.078141 -0.0293436 -0.0000016 0.0300417 -0.0107012 0.0000044 0.0000329 0.000002 0.160476 0.0901448 -0.0651231 -0.0000128 -0.0021178 0.1216741 -0.0000043 0.0000033 0.0000104 0.1747028 0.0901438 0.0651219 -0.0000156 0.0021173 0.1216726 0.0000049 0.0000078 -0.0000122 0.1747032 unknown
polarizability: 397.4659407|0.0001103|178.8338913|0.0085574|-0.0006646|61.9254927 unknown
InChI: InChI=1S/C12H6N4O4/c17-15(18)7-1-3-9-11(5-7)14-12-6-8(16(19)20)2-4-10(12)13-9/h1-6H
charge 0 multiplicity 1
26 atoms
O  5.970023 -0.235242 -0.000188
O  4.865939 -2.232608 0.00027
O  -5.970043 -0.235252 0.000328
O  -4.865954 -2.232611 -0.00016
N  -0.000004 -0.965425 -0.000019
N  -0.000002 1.941653 -0.000017
N  4.891251 -0.944389 0.00041
N  -4.891261 -0.944389 -0.00046
C  1.165008 -0.24398 0.000102
C  -1.165015 -0.243978 -0.000142
C  1.166283 1.222344 0.000088
C  -1.166288 1.222346 -0.000125
C  2.412488 -0.950925 0.000181
C  -2.412497 -0.950921 -0.000223
C  2.421988 1.921751 0.00016
C  -2.421991 1.921754 -0.000197
C  3.590903 -0.216044 0.000286
C  -3.590911 -0.216039 -0.00033
C  3.619594 1.221023 0.000261
C  -3.6196 1.221029 -0.0003
H  2.417561 -2.043568 0.000202
H  -2.417569 -2.043565 -0.000248
H  2.39345 3.014884 0.000154
H  -2.393452 3.014887 -0.000192
H  4.589304 1.724378 0.000309
H  -4.589307 1.724387 -0.000352
