program: Gaussian 09
title: 000149832
version: EM64L-G09RevD.01
frameworkgroup: C1[X(C26H26ClFO3)]
method: RPBEPBE
basis: SDD
operation: Freq
keyword: #p
keyword: freq=noraman
keyword: PBEPBE/SDD
title: #p freq=noraman PBEPBE/SDD
converged: YES YES NO NO
title: Mulliken charges:
elementType: Cl F O O O C C C C C C C C C C C C C C C C C C C C C C C C C C H H H H H H H H H H H H H H H H H H H H H H H H H H
charge: -0.062679 -0.205028 -0.275356 -0.230131 -0.287273 -0.354200 -0.062772 0.476354 -0.720326 -0.708051 0.238883 -0.362985 -0.438850 -0.293460 -0.438145 0.470124 0.501881 -0.489437 0.386680 -0.172898 -0.211933 -0.458784 -0.461743 -0.139324 -0.218509 -0.361387 -0.367379 -0.378537 -0.373791 -0.506686 0.314150 0.243418 0.230229 0.229881 0.212139 0.216870 0.240711 0.215473 0.202675 0.261829 0.241491 0.203803 0.247938 0.225463 0.272953 0.261694 0.254263 0.241971 0.239371 0.231839 0.253011 0.285010 0.255713 0.262586 0.200871 0.237263 0.223126
chargesum: 0.00000
title: Mulliken charges with hydrogens summed into heavy atoms:
elementType: Cl F O O O C C C C C C C C C C C C C C C C C C C C C C C C C C
charge: -0.062679 -0.205028 -0.275356 -0.230131 -0.287273 -0.110782 0.167457 0.476354 -0.061436 -0.049192 0.238883 -0.101155 -0.197359 -0.089658 0.035255 0.470124 0.501881 -0.216484 0.386680 0.088795 0.042330 -0.216812 -0.222372 -0.139324 0.013330 -0.108376 -0.082369 -0.122824 -0.111206 0.154574 0.314150
polarizability: 2.91922184e+02 -1.67952104e+01 3.43872758e+02 -3.76343805e-01 -2.42753766e+01 2.37543374e+02
1716.lowfreq: -5.5106 0.0006 0.0011 0.0013 2.4055 4.8423 9.8013 12.3770 22.1496
frequency: 9.2254 11.2929 22.0908 31.8390 33.2736 42.2453 49.0695 53.8992 57.5391 65.7195 76.5707 86.8250 110.9624 116.2484 135.4749 147.5794 157.6656 191.6624 197.8924 205.7927 210.7940 221.5268 227.3267 243.2545 261.1583 270.1594 282.4145 302.6305 320.0065 324.9808 332.6590 361.1307 375.3814 393.0691 395.6091 410.4941 412.3349 422.5963 425.2585 467.6945 480.1988 495.2635 510.0999 533.9411 558.3788 608.6137 623.1717 625.6063 632.4485 636.6442 676.0199 698.5044 705.7643 711.5904 733.2315 765.8930 771.9807 796.3018 814.6477 820.9739 824.4749 830.9263 836.9697 850.4497 869.0907 869.4191 903.0037 909.8339 921.5834 929.7052 932.4287 943.3518 954.2889 957.6162 959.1359 964.6800 971.3226 976.4601 985.1470 989.8775 993.9729 999.8633 1006.7424 1039.5214 1073.2214 1097.7992 1100.2334 1103.8560 1108.6870 1117.3381 1131.3415 1147.2076 1153.5664 1155.7497 1167.4780 1171.4075 1183.3548 1187.3322 1191.1228 1198.6344 1199.2215 1206.0787 1244.9419 1257.6971 1270.4956 1278.2874 1290.2542 1299.0583 1304.1790 1309.0532 1323.7907 1337.5253 1355.4351 1376.7910 1379.2918 1381.9002 1389.9905 1397.2093 1399.3499 1401.0267 1431.0031 1444.9028 1455.4530 1465.7334 1470.9462 1475.2058 1476.0248 1476.5494 1479.1302 1480.8654 1487.0844 1492.1879 1585.8038 1595.7182 1598.6836 1599.9196 1611.0207 1617.7366 1629.4350 2893.5687 2940.3073 2972.5542 2975.6694 3000.4191 3007.6718 3023.0941 3024.3095 3063.4171 3069.6145 3072.6652 3076.0022 3084.9042 3109.5964 3116.3529 3127.3477 3132.9732 3137.3109 3143.5765 3153.1787 3156.3800 3167.2425 3170.1590 3174.1580 3178.1616 3186.5638
redmass: 7.5293 5.6472 6.6485 5.6926 4.8053 5.3858 5.6258 4.9819 5.0648 2.8978 3.6513 4.3549 3.2297 4.2463 4.5261 2.3523 4.0773 5.7363 2.5858 1.3507 2.0558 1.7406 2.4521 4.0155 5.4607 4.2178 3.4004 3.5916 4.0202 5.6010 6.2196 3.9138 3.8546 3.9846 3.5901 2.9057 2.9978 3.1164 3.6860 3.8402 4.1628 3.0595 3.1821 5.8652 5.3447 6.0811 6.8721 6.7229 6.1639 6.5983 4.9830 3.8795 5.8354 2.0806 4.1213 3.0513 4.2663 2.6752 2.2617 1.4340 1.4429 1.7079 1.4967 4.2208 2.5060 2.6365 3.0845 2.0213 1.2187 2.2175 1.7193 1.8535 1.6254 1.4912 1.5008 2.5928 1.3603 1.3512 1.4786 3.2002 2.2854 4.3768 2.7805 7.8897 2.7189 1.6990 1.5256 1.3240 3.1477 1.2713 1.8134 1.5251 1.6728 1.5559 2.9684 1.8565 1.1004 1.1288 1.6419 1.1812 2.6449 2.8939 1.7061 1.4493 1.3837 1.7692 1.3090 1.3898 1.3249 1.4701 1.4048 1.3253 1.6061 6.4007 4.8053 1.2754 5.0961 1.4992 3.3154 1.8094 1.1994 2.3510 1.0545 1.0522 1.0462 1.8468 1.2700 1.1810 1.9860 1.0546 1.0461 2.6602 7.2817 6.3594 6.8575 6.9664 6.3998 6.3032 10.0613 1.0818 1.0348 1.0361 1.0370 1.0829 1.0575 1.0852 1.1009 1.0989 1.1069 1.0984 1.0993 1.0992 1.0988 1.0877 1.0908 1.0898 1.0920 1.0892 1.0893 1.0987 1.0890 1.0954 1.0958 1.0961 1.0966
irintensity: 0.2387 0.3290 0.1864 0.0221 0.1849 0.2736 0.6737 0.3639 0.5422 0.0647 0.6884 0.2625 3.2408 0.5617 0.3644 1.0572 0.9964 1.6096 1.7202 0.7019 9.6168 1.9153 3.3561 3.4445 2.2232 4.6693 0.5593 0.8274 0.7317 0.2891 0.0658 2.3721 0.6122 1.4342 9.8060 0.1622 0.0736 0.7544 6.3754 5.0989 8.5105 17.6616 22.6171 15.0208 11.7681 3.5865 1.2899 6.4719 15.5338 2.3463 5.3485 1.3708 11.2541 33.0739 12.6308 31.5905 1.9973 67.8161 7.2489 17.0826 20.9161 35.4278 20.6993 6.8378 7.8579 18.1762 9.8030 39.1411 2.1599 45.0984 5.0149 28.7599 15.8891 3.6156 7.1948 49.5150 0.1843 0.1139 0.8600 1.7373 2.2354 36.4783 19.5318 110.6880 35.6705 9.7115 3.6022 8.3108 91.7029 0.4937 5.2612 21.0724 43.9301 32.2640 148.7637 26.3561 2.4119 0.9305 11.3871 5.5453 35.2807 18.9099 1.3551 3.7562 13.8580 11.9875 9.9956 20.0542 1.0086 1.5450 1.7119 3.0015 6.9985 2.4570 1.6211 13.7113 0.7423 26.5460 6.1122 2.3512 4.1109 9.8990 8.4251 0.7540 5.0927 42.6649 20.3595 30.5718 4.0578 4.8127 15.5697 119.2122 0.4341 5.2425 1.6988 9.9970 14.0600 15.7928 217.9760 41.0127 80.4898 27.1250 32.2314 1.7355 19.3550 15.6314 51.5037 5.6873 14.5827 59.5989 38.6144 41.5090 22.3415 3.7698 16.1038 8.2136 4.1680 5.0899 4.8219 26.8514 0.8732 3.7998 3.3657 2.1402 2.1403
temp: 298.150 k
press: 1.00000 atm
elementType: 17 9 8 8 8 6 6 6 6 6 6 6 6 6 6 6 6 6 6 6 6 6 6 6 6 6 6 6 6 6 6 1 1 1 1 1 1 1 1 1 1 1 1 1 1 1 1 1 1 1 1 1 1 1 1 1 1
symmnumber: 1
zpe: 1183124.6 jmol-1
zpe.correction: 0.450628 hartree
zpe.thermalcorrener: 0.481015 hartree
zpe.thermalcorrenthalpy: 0.481959 hartree
zpe.thermalcorrgfe: 0.384395 hartree
zpe.sumelectzpe: -1789.693285 hartree
zpe.sumelectthermal: -1789.662899 hartree
zpe.sumelectthermalent: -1789.661955 hartree
zpe.sumelectthermalfe: -1789.759519 hartree
dipole: -1.6111 -4.7850 0.9476
dipole: 5.1371
quadrupole: -174.4105 -191.2419 -189.7727
quadrupole: 16.4648 10.0839 -10.7791
quadrupole: 10.7312 -6.1002 -4.6310 16.4648 10.0839 -10.7791
hfenergy: -1790.1439137 hartree
pointgroup: C01 [X(C26H26Cl1F1O3)]
dipole: 0.6396468 1.8257991 0.5849143 debye
polarizability: 290.9411415|-17.8729917|339.5072842|3.0441959|32.187376|242.8898895 unknown
InChI: InChI=1S/C26H26ClFO3/c1-17(2)24(19-7-11-22(27)12-8-19)26(29)31-16-18-5-4-6-21(15-18)25(30-3)20-9-13-23(28)14-10-20/h4-15,17,24-25H,16H2,1-3H3
charge 0 multiplicity 1
57 atoms
Cl -0.429473 -4.469301 -2.004245
F  2.055602 -4.14803 2.46084
O  -1.844555 2.095433 -0.056883
O  -3.365459 2.468539 -1.78236
O  3.394964 0.547001 -1.600302
C  -3.670157 0.509949 -0.294787
C  -3.962242 0.574286 1.243767
C  -2.854713 -0.720594 -0.711349
C  -4.747268 1.85772 1.602171
C  -4.7393 -0.682245 1.69835
C  -2.985594 1.782189 -0.807198
C  -1.577336 -0.985357 -0.151901
C  -3.372798 -1.620879 -1.675115
C  3.380144 0.797887 -0.147266
C  -1.05374 3.27873 -0.532115
C  2.491535 1.99029 0.212132
C  0.341563 3.173752 0.035661
C  1.169788 2.071458 -0.285215
C  2.965155 -0.516251 0.525033
C  -0.835727 -2.12251 -0.53718
C  -2.645341 -2.76574 -2.074472
C  2.98962 3.032911 1.030409
C  0.847976 4.201586 0.870478
C  -1.384342 -2.996352 -1.495202
C  2.169306 4.133736 1.363901
C  2.460765 -0.51793 1.850149
C  3.15166 -1.75153 -0.144677
C  2.153611 -1.729889 2.507586
C  2.843194 -2.974203 0.492898
C  4.03982 1.619627 -2.362123
C  2.356871 -2.93302 1.810407
H  -4.641321 0.481258 -0.824699
H  -2.987874 0.603083 1.769025
H  -4.183383 2.771821 1.341674
H  -5.716799 1.88952 1.069084
H  -4.957466 1.89027 2.68674
H  -4.186637 -1.611303 1.474585
H  -4.922089 -0.64696 2.787988
H  -5.723923 -0.73951 1.194611
H  -1.14763 -0.296013 0.581729
H  -4.354573 -1.430368 -2.123879
H  4.421351 1.039148 0.176841
H  -1.068961 3.266581 -1.637503
H  -1.569506 4.19301 -0.189052
H  0.793535 1.269454 -0.931469
H  0.149634 -2.318158 -0.105827
H  -3.051358 -3.457224 -2.818224
H  4.020174 2.984397 1.404624
H  0.209833 5.054983 1.130148
H  2.557935 4.935087 2.001445
H  2.30016 0.430106 2.374485
H  3.523305 -1.742071 -1.172113
H  1.766579 -1.747562 3.530485
H  2.973625 -3.934392 -0.014032
H  5.084938 1.780287 -2.022165
H  4.040305 1.282434 -3.410194
H  3.482421 2.57356 -2.279498
