program: Gaussian 09
title: 000149705
version: EM64L-G09RevD.01
frameworkgroup: C1[X(C19H14O2)]
method: RPBEPBE
basis: SDD
operation: Freq
keyword: #pfreq=noraman
keyword: PBEPBE/SDD
title: #p freq=noraman PBEPBE/SDD
converged: YES YES NO NO
title: Mulliken charges:
elementType: O O C C C C C C C C C C C C C C C C C C C H H H H H H H H H H H H H H
charge: -0.252596 -0.270133 0.023877 -0.020695 0.293098 0.478406 0.490090 0.474944 0.392179 -0.454253 -0.532909 -0.484103 -0.503423 -0.483402 -0.438242 -0.467373 -0.464250 -0.534704 -0.242132 0.319878 -0.751115 0.281926 0.240177 0.239566 0.241624 0.237908 0.233648 0.244900 0.241650 0.235895 0.252343 0.227809 0.246592 0.254142 0.248678
chargesum: 0.00000
title: Mulliken charges with hydrogens summed into heavy atoms:
elementType: O O C C C C C C C C C C C C C C C C C C C
charge: -0.252596 -0.270133 0.023877 -0.020695 0.293098 0.478406 0.490090 0.474944 0.392179 -0.172328 -0.292731 -0.244537 -0.261799 -0.245495 -0.204593 -0.222472 -0.222600 -0.046467 -0.014323 0.319878 -0.001704
polarizability: 3.17262983e+02 -3.19061479e+01 2.64617398e+02 2.14120535e+01 6.81627531e+00 1.06725977e+02
1716.lowfreq: -29.7593 -4.1172 -0.0006 -0.0005 -0.0004 0.5145 5.2293 29.7096 42.4680
frequency: -29.7429 29.5990 42.4650 69.6427 95.4697 117.7783 171.4148 188.8430 221.5080 229.6284 265.6009 308.1612 317.3113 388.2414 399.8932 410.1443 452.3597 460.5427 484.2172 505.9110 511.6781 520.7890 531.9046 555.6978 573.8731 578.6144 594.4040 633.2715 687.4339 697.6340 707.3847 740.2809 766.3900 769.4017 783.3470 809.7161 820.3102 846.0956 860.5719 880.0767 881.5252 901.3472 919.1754 961.4511 966.8961 979.7019 989.4627 991.3913 999.9041 1001.9774 1045.7635 1062.2395 1104.5757 1114.5138 1156.9584 1177.5118 1185.1665 1188.9599 1201.9634 1225.5454 1230.1656 1249.9344 1259.3657 1264.1336 1333.1166 1349.9267 1382.5865 1382.9633 1396.1702 1408.6265 1428.2758 1432.5963 1438.5678 1455.0201 1458.3235 1465.3123 1487.9961 1495.5647 1515.4049 1549.9207 1595.3515 1603.6248 1612.9144 1633.3699 1637.3166 3009.0354 3035.5634 3097.5459 3102.4550 3119.9493 3120.8103 3123.6160 3126.4763 3133.0254 3142.2173 3143.6096 3146.0908 3150.6743 3157.6725
redmass: 1.0584 5.2198 4.2322 7.8548 4.4821 4.2848 5.6376 5.2627 4.1974 5.2789 4.5817 3.5656 3.2205 4.1093 5.4025 3.9963 3.6119 5.2319 4.2320 4.2087 4.2687 3.7319 4.8985 3.1732 4.2510 4.4300 4.4953 4.2590 7.0078 3.8574 4.4191 2.9384 5.4312 1.2938 2.8905 4.5666 1.5624 2.4415 2.8462 1.8598 3.5114 5.9427 1.5046 1.4926 3.4660 1.3668 1.5145 1.8145 1.9135 1.3556 1.6397 2.5973 2.3139 2.1434 1.3529 1.4409 1.3909 2.9720 1.4567 1.2557 1.8595 1.5556 2.2302 1.8649 1.9987 1.6858 3.8394 1.2973 2.2648 2.5635 4.2028 5.6701 2.2532 1.0691 1.0474 4.4011 1.2536 3.4005 4.0258 4.9135 6.8176 6.7978 6.3511 9.2770 7.5639 1.0364 1.0574 1.0973 1.1078 1.0868 1.0867 1.0861 1.0877 1.0917 1.1012 1.0977 1.0975 1.0973 1.0990
irintensity: 1.4204 1.1425 0.1982 4.3564 0.6331 1.6240 1.4066 4.7724 10.5700 5.0927 0.2061 3.5373 4.0558 7.0428 0.1898 0.5753 7.2066 1.6854 1.6204 1.2796 2.4252 3.6823 0.2299 1.5569 1.6668 5.5088 3.7447 5.8941 0.2299 2.9131 16.4611 32.4487 9.6264 14.1272 2.2858 4.2205 3.5869 5.5149 9.9190 151.1054 3.7565 139.0350 2.8294 2.5721 2.7733 3.5390 2.1387 14.9312 24.0664 2.2470 11.5666 8.9912 5.2006 1.9550 4.1181 10.6958 6.2324 312.6704 51.8482 33.3264 2.9468 3.5995 7.9304 0.9652 3.2069 13.1992 3.1597 51.9253 1.0916 4.0764 0.2115 0.2222 1.7781 17.2781 16.7308 4.7275 18.9109 2.0879 2.0655 0.1949 6.0602 10.1405 5.9142 145.9419 13.4041 3.8505 29.7597 6.7090 8.2080 10.5132 4.1175 0.5846 8.1435 17.5861 7.7047 16.2586 49.4859 5.1910 42.4209
temp: 298.150 k
press: 1.00000 atm
elementType: 8 8 6 6 6 6 6 6 6 6 6 6 6 6 6 6 6 6 6 6 6 1 1 1 1 1 1 1 1 1 1 1 1 1 1
symmnumber: 1
zpe: 716317.5 jmol-1
zpe.correction: 0.272831 hartree
zpe.thermalcorrener: 0.288360 hartree
zpe.thermalcorrenthalpy: 0.289304 hartree
zpe.thermalcorrgfe: 0.229319 hartree
zpe.sumelectzpe: -881.497705 hartree
zpe.sumelectthermal: -881.482176 hartree
zpe.sumelectthermalent: -881.481231 hartree
zpe.sumelectthermalfe: -881.541217 hartree
dipole: 0.6059 1.2476 1.0444
dipole: 1.7363
quadrupole: -105.2409 -109.3655 -124.2362
quadrupole: -4.9899 -2.0455 -2.9151
quadrupole: 7.7066 3.5820 -11.2886 -4.9899 -2.0455 -2.9151
hfenergy: -881.7705357 hartree
pointgroup: C01 [X(C19H14O2)]
dipole: 0.2205738 0.5204619 0.3835278 debye
polarizability: 320.2129763|-28.4758021|262.4014559|20.8271861|0.1288699|105.9919264 unknown
InChI: InChI=1S/C19H14O2/c1-12(20)21-11-16-8-7-15-6-5-13-3-2-4-14-9-10-17(16)19(15)18(13)14/h2-10H,11H2,1H3
charge 0 multiplicity 1
35 atoms
O  -3.824059 0.287505 0.354454
O  -4.085554 -1.919567 -0.375442
C  0.723877 0.648737 -0.157375
C  1.824508 -0.265876 -0.006772
C  -0.602563 0.153587 -0.454096
C  0.95566 2.066589 -0.011888
C  1.611906 -1.684622 -0.152139
C  3.148493 0.22865 0.288654
C  -1.677555 1.08955 -0.603832
C  -0.784702 -1.279078 -0.589226
C  0.277339 -2.154238 -0.446836
C  2.291485 2.537627 0.285156
C  -0.13416 2.962756 -0.168014
C  3.345805 1.655318 0.430375
C  -1.420789 2.474981 -0.459581
C  2.710824 -2.573901 -0.0021
C  4.219634 -0.69432 0.431564
C  -3.088536 0.653149 -0.917884
C  4.000678 -2.08112 0.286859
C  -4.269897 -1.029616 0.489817
C  -4.994016 -1.219867 1.805241
H  -1.782168 -1.677996 -0.800265
H  0.115699 -3.233281 -0.555003
H  2.449896 3.617062 0.392853
H  0.036375 4.040166 -0.062366
H  4.353677 2.023615 0.655378
H  -2.251894 3.180862 -0.576265
H  2.544972 -3.651813 -0.112964
H  5.224014 -0.316599 0.656098
H  -3.674086 1.491923 -1.326629
H  -3.145355 -0.211699 -1.600011
H  4.837451 -2.778845 0.399946
H  -6.035085 -1.529371 1.606735
H  -4.988081 -0.296821 2.401727
H  -4.511893 -2.035448 2.371133
