program: Gaussian 09
title: 000009111
version: EM64L-G09RevD.01
frameworkgroup: C1[X(C24H14)]
method: RPBEPBE
basis: SDD
operation: Freq
keyword: #p
keyword: freq=noraman
keyword: PBEPBE/SDD
title: #p freq=noraman PBEPBE/SDD
converged: NO YES NO YES
title: Mulliken charges:
elementType: C C C C C C C C C C C C C C C C C C C C C C C C H H H H H H H H H H H H H H
charge: -0.017935 0.274989 0.001681 0.249982 0.582949 0.328260 0.498237 -0.845590 0.474855 0.109510 -0.419203 -0.525369 -0.522859 -0.407035 0.441088 -0.488076 -0.526385 -0.470177 -0.467897 -0.331488 -0.245746 -0.445095 -0.265156 -0.253209 0.233512 0.222863 0.246145 0.236100 0.223744 0.237806 0.234230 0.243880 0.241466 0.221411 0.227269 0.243477 0.227798 0.229972
chargesum: 0.00000
title: Mulliken charges with hydrogens summed into heavy atoms:
elementType: C C C C C C C C C C C C C C C C C C C C C C C C
charge: -0.017935 0.274989 0.001681 0.249982 0.582949 0.328260 0.498237 -0.612078 0.474855 0.109510 -0.196340 -0.279224 -0.286759 -0.183291 0.441088 -0.250270 -0.292155 -0.226297 -0.226431 -0.110078 -0.018477 -0.201618 -0.037358 -0.023238
polarizability: 5.67025302e+02 -3.58200518e+00 2.81089380e+02 -3.92289067e-03 -7.65806217e-03 9.45381862e+01
1716.lowfreq: -6.2132 -0.0008 -0.0001 0.0007 3.5449 9.2975 40.8824 54.1476 106.9928
frequency: 40.8819 54.1465 106.9927 146.5828 150.1069 195.7292 204.6417 222.3033 252.3555 293.4136 323.6577 332.4896 390.6043 426.8858 431.4497 445.3709 472.5612 485.9846 501.1995 509.6584 510.8323 521.3863 540.6050 560.9108 565.6424 568.7457 580.4546 636.7493 676.8242 677.2331 699.0745 736.6537 743.9201 758.7723 759.5476 769.1400 800.5705 801.0966 824.3025 827.6395 831.8472 866.5249 870.4688 878.7555 888.3254 902.5010 914.9590 945.7051 956.4531 977.6507 979.2959 985.0399 985.5036 991.6215 992.3089 1035.3419 1046.9549 1083.8282 1108.0695 1127.1398 1153.4672 1163.2397 1178.5468 1180.7655 1196.8376 1226.2733 1234.8159 1239.8655 1253.6388 1263.7798 1274.1356 1307.1222 1335.9911 1356.7613 1386.5908 1400.3608 1409.1563 1415.1874 1421.4179 1428.4671 1436.9847 1451.4075 1467.0794 1469.8364 1495.2376 1515.4911 1528.2508 1563.5894 1587.8521 1603.5943 1606.1894 1613.4094 1623.0711 1636.4388 3117.8196 3121.4158 3122.1383 3124.2406 3126.6600 3131.6673 3132.0288 3140.4489 3143.4901 3152.6018 3156.0805 3157.1654 3165.6824 3169.5702
redmass: 5.3811 4.3692 4.5037 5.2932 4.1413 3.8832 4.0428 4.5557 6.9912 3.6781 5.7286 4.8532 3.3202 4.9781 3.0249 5.5088 7.6269 5.8675 3.7222 3.5300 5.4628 6.4898 3.1474 3.3549 6.1185 2.7312 6.8288 6.6635 3.5976 6.6550 3.2491 2.0752 5.9867 6.0060 1.3286 1.2721 1.6677 5.6472 1.4927 5.0868 1.9812 1.9693 4.3041 2.3665 1.7406 6.0194 1.5027 2.0020 1.4854 1.4263 1.5239 1.4055 5.3944 1.4574 1.4639 3.0745 2.7566 2.1000 2.5234 2.1297 1.4644 1.3192 1.1754 1.2120 1.2870 1.9220 1.5893 1.9057 1.7067 1.8539 1.6958 2.6801 2.7566 3.1852 4.2995 3.7121 2.7308 2.6560 4.6152 3.0297 3.3727 2.9227 3.5646 3.8218 4.4297 3.7373 4.8359 5.7455 6.6155 6.1626 6.8080 6.3092 6.4822 7.4426 1.0862 1.0865 1.0861 1.0874 1.0887 1.0916 1.0888 1.0925 1.0973 1.0926 1.0988 1.0968 1.0988 1.0920
irintensity: 0.3299 0.1506 0.0475 0.3669 0.1703 1.1705 3.6462 7.9149 0.1583 0.2486 0.1975 0.1279 0.3243 2.4425 5.8494 0.3701 2.9982 0.0186 1.3335 1.2705 7.3302 0.3211 4.4140 0.1763 3.8805 3.8479 0.4080 6.6516 9.8884 1.0866 9.5980 20.0207 0.6446 2.1130 36.1762 3.7544 0.0831 8.1202 77.2681 0.1955 29.8080 22.8364 3.1616 70.8793 0.1146 0.1237 0.2183 27.6527 0.2938 2.7064 2.5485 5.2695 1.0138 0.1397 1.5612 12.5247 1.0639 2.7715 1.6094 3.0779 3.6031 0.9085 0.7524 0.8879 19.9343 1.2433 6.4223 3.3668 7.7148 1.3967 2.2288 4.6598 1.0858 1.0565 4.9100 1.1218 3.1047 3.3162 1.3419 7.6199 8.9924 8.0813 0.6218 1.8660 1.7588 7.8339 0.2570 0.9003 4.5361 6.0131 3.5631 3.3863 0.4536 0.0779 0.5668 1.8211 0.6393 2.5293 9.6041 15.1240 13.2958 8.4096 26.2486 37.0619 41.8943 15.6653 45.8594 34.7868
temp: 298.150 k
press: 1.00000 atm
elementType: 6 6 6 6 6 6 6 6 6 6 6 6 6 6 6 6 6 6 6 6 6 6 6 6 1 1 1 1 1 1 1 1 1 1 1 1 1 1
symmnumber: 1
zpe: 779374.7 jmol-1
zpe.correction: 0.296848 hartree
zpe.thermalcorrener: 0.312549 hartree
zpe.thermalcorrenthalpy: 0.313493 hartree
zpe.thermalcorrgfe: 0.254305 hartree
zpe.sumelectzpe: -921.477994 hartree
zpe.sumelectthermal: -921.462293 hartree
zpe.sumelectthermalent: -921.461349 hartree
zpe.sumelectthermalfe: -921.520537 hartree
dipole: 0.0339 -0.0058 0.0001
dipole: 0.0344
quadrupole: -114.4982 -116.0216 -148.3169
quadrupole: -0.1227 -0.0003 -0.0016
quadrupole: 11.7807 10.2573 -22.0380 -0.1227 -0.0003 -0.0016
hfenergy: -921.7748419 hartree
pointgroup: C01 [X(C24H14)]
dipole: 0.0133559 0.0022751 -0.0000234 debye
polarizability: 567.0224821|3.692848|281.0922002|0.0039259|-0.0076565|94.5381862 unknown
InChI: InChI=1S/C24H14/c1-2-7-19-15(4-1)10-12-20-21-13-11-17-6-3-5-16-8-9-18(14-22(19)20)24(21)23(16)17/h1-14H
charge 0 multiplicity 1
38 atoms
C  -1.2811 0.124041 -0.000043
C  -0.492735 -1.077416 -0.000032
C  -2.71881 0.063138 -0.000088
C  0.954567 -0.989637 0.000051
C  -0.622148 1.413632 0.000007
C  1.596116 0.307058 -0.000023
C  -3.388697 -1.213198 -0.000155
C  0.78443 1.47429 -0.000007
C  -3.501225 1.277126 -0.000057
C  3.063371 0.392803 -0.000087
C  -1.195816 -2.340613 -0.000131
C  -1.432249 2.61572 0.000054
C  -2.579795 -2.406581 -0.000198
C  1.783686 -2.172446 0.000247
C  3.842274 -0.82104 0.000108
C  -2.811207 2.551941 0.00002
C  3.163761 -2.094255 0.000317
C  -4.812218 -1.257133 -0.000195
C  -4.917433 1.189879 -0.000099
C  3.769215 1.635037 -0.000383
C  -5.564962 -0.067052 -0.00017
C  5.269603 -0.754358 0.000075
C  5.170704 1.681802 -0.00042
C  5.932204 0.478269 -0.000173
H  1.248872 2.465425 0.00004
H  -0.629658 -3.275722 -0.000198
H  -0.921227 3.585752 0.000118
H  -3.083111 -3.380738 -0.000295
H  1.314848 -3.16007 0.000401
H  -3.411596 3.469335 0.000062
H  3.768963 -3.00873 0.000537
H  -5.316827 -2.230333 -0.000251
H  -5.509245 2.112843 -0.000074
H  3.217473 2.579636 -0.000631
H  -6.659431 -0.114049 -0.000204
H  5.839968 -1.690955 0.000237
H  5.682372 2.650608 -0.00067
H  7.026761 0.52049 -0.000191
