program: Gaussian 09
title: 000149724
version: EM64L-G09RevD.01
frameworkgroup: C1[X(C22H21FN4O2S)]
method: RPBEPBE
basis: SDD
operation: Freq
keyword: #p
keyword: freq=noraman
keyword: PBEPBE/SDD
title: #p freq=noraman PBEPBE/SDD
converged: YES YES NO NO
title: Mulliken charges:
elementType: S F O O N N N N C C C C C C C C C C C C C C C C C C C C C C H H H H H H H H H H H H H H H H H H H H H
charge: 0.971173 -0.200849 -0.538955 -0.548241 -0.488082 -0.251847 -0.039667 -0.475539 0.255531 0.266026 0.224288 0.230479 0.221993 -0.054737 -0.091934 -0.374731 0.249538 -0.291394 -0.392074 -0.305069 -0.378172 -0.496906 -0.308741 -0.417027 -0.265195 -0.639717 -0.641574 0.350654 -0.231286 -0.769520 0.344837 0.288173 0.270764 0.231714 0.271300 0.228004 0.293300 0.268513 0.263115 0.261125 0.232048 0.211824 0.261091 0.227818 0.224561 0.230677 0.251440 0.235703 0.263922 0.297073 0.274571
chargesum: 0.00000
title: Mulliken charges with hydrogens summed into heavy atoms:
elementType: S F O O N N N N C C C C C C C C C C C C C C C C C C C C C C
charge: 0.971173 -0.200849 -0.538955 -0.548241 -0.143245 -0.251847 -0.039667 -0.212424 0.255531 0.266026 0.224288 0.230479 0.221993 -0.054737 -0.091934 -0.086558 0.249538 -0.020630 -0.160360 -0.033769 -0.150168 -0.203606 -0.040229 -0.155902 -0.033147 0.061016 0.065104 0.350654 0.004418 0.066047
polarizability: 6.17456501e+02 1.92514042e+01 3.79667603e+02 -3.31985921e+00 1.30563266e+01 2.36230190e+02
1716.lowfreq: -5.6524 -1.7535 -0.0017 -0.0007 0.0003 4.8480 17.3281 20.1124 24.8844
frequency: 17.2300 20.0005 24.6929 34.8970 44.5542 48.6376 70.8647 77.2410 97.5513 114.8110 117.3955 120.1308 132.8993 149.8534 166.4329 171.2804 184.4987 202.2702 210.2499 219.5913 240.7247 251.7888 271.1106 285.4912 304.8110 318.8370 326.5196 333.3882 337.0906 350.8699 366.7535 382.7709 394.4597 396.8954 416.7836 455.2081 470.1613 473.4638 485.4929 511.9014 526.4189 536.2105 538.3034 543.6796 580.7420 600.2459 621.2499 634.7185 641.0687 652.4638 692.8634 710.0400 728.2119 734.2147 748.5449 764.5958 773.7203 785.6566 794.9170 804.5868 810.4999 816.6751 849.2141 863.5887 874.0876 875.5967 880.2224 884.2733 896.4196 922.2011 937.7264 947.1491 954.8207 961.5917 964.2390 977.4349 996.2720 1002.7083 1023.2743 1039.5420 1070.8191 1086.8442 1102.2556 1113.7147 1126.4473 1141.6073 1150.7882 1159.9243 1175.0028 1180.0739 1180.2492 1214.8397 1225.8986 1250.0389 1260.6105 1266.8658 1282.0252 1286.7980 1303.5118 1322.6585 1335.5700 1359.6411 1381.8856 1393.4444 1411.1354 1417.4387 1423.3102 1424.8910 1436.6093 1439.0522 1446.0358 1453.0288 1459.1664 1462.7204 1476.7514 1478.6818 1484.9414 1500.6538 1509.9094 1529.1302 1547.9902 1554.2176 1564.1147 1600.8764 1613.5065 1633.7196 2929.2305 2934.3933 3027.4886 3041.8118 3043.1654 3097.2557 3106.9418 3123.4437 3125.5893 3139.6956 3157.4778 3161.2291 3166.9329 3172.7969 3177.4826 3181.6391 3182.6424 3183.8954 3189.1962 3330.6653 3351.0566
redmass: 6.6993 6.5944 5.4271 5.3605 5.3579 4.7104 6.1652 2.9893 4.7491 7.4879 4.3561 4.1758 4.3287 3.4017 1.7591 2.8198 2.5909 6.0853 1.8608 2.2122 3.4737 1.2727 3.4948 4.4326 6.4710 5.8950 4.4042 7.6354 6.5681 3.0775 7.0918 5.7429 4.6779 4.3741 3.6257 5.2794 4.2827 2.9910 3.4870 4.1012 6.0399 3.7777 8.3227 5.0829 7.9731 4.9801 4.4149 4.5009 5.5651 6.0632 5.4586 4.4197 3.0960 3.4487 6.2240 1.6070 1.5659 2.0222 2.8767 5.6950 1.7503 2.0846 1.7611 3.2695 1.6964 1.5959 3.5837 2.0763 1.6712 5.1107 1.3346 1.3214 1.7142 2.2093 1.3592 2.5601 1.3293 2.1829 2.1225 1.6371 3.6486 1.2723 2.0816 1.8627 1.9309 1.4681 1.4451 1.3406 1.2261 1.4838 2.0191 2.0037 1.6718 4.1762 2.1522 1.5563 1.1368 4.7138 1.6606 3.6947 2.2662 2.5742 4.1679 4.7426 1.0593 1.0651 2.1538 1.4972 2.4400 2.3738 2.2989 3.0573 1.5220 1.1839 1.2323 1.1100 2.1168 1.1515 3.5360 7.6826 6.6229 8.2231 3.9892 6.3844 6.1051 6.9371 1.0481 1.0468 1.0239 1.0844 1.0864 1.1009 1.1011 1.0896 1.0858 1.0892 1.0950 1.0875 1.0940 1.0995 1.1072 1.1080 1.0975 1.0922 1.0935 1.0752 1.0736
irintensity: 1.1450 3.3994 1.4874 0.3660 0.3194 2.2980 0.9822 1.0145 8.3952 45.9894 4.7816 1.2453 41.4790 0.3873 10.8295 0.3697 25.5999 2.6596 18.3191 1.0513 0.5101 0.2219 4.5615 3.0006 9.8065 16.6783 15.5745 1.2844 4.9303 0.3875 18.3675 5.7399 8.6086 17.1219 6.2452 5.4548 30.9617 1.0894 30.3208 9.1060 4.3484 3.7636 38.3986 13.4386 8.9741 24.8662 5.0753 9.1782 4.4941 22.8915 2.2073 13.2953 82.0126 6.5404 14.0984 163.1076 18.9924 60.3297 9.1393 98.2580 30.6927 23.1339 83.5082 29.1357 0.9480 40.9005 13.9622 25.6516 6.0161 3.1985 2.7724 138.6192 18.8190 29.5910 1.0110 45.0839 0.4146 51.0216 8.8132 14.6144 11.1964 10.6267 25.5706 20.6961 76.7547 7.8642 4.3605 15.8105 3.5605 25.3592 22.3329 22.7022 12.0304 64.1908 26.5317 11.2251 12.7345 5.5546 6.4530 58.9897 70.1237 65.5774 53.7083 57.3589 5.5817 8.3499 24.2113 42.0653 43.8828 41.2185 114.3322 77.4573 85.2673 14.6057 31.5267 16.8944 64.1127 75.0548 537.1539 46.8388 29.9830 168.0576 65.8056 226.1937 80.4582 64.2699 48.9341 136.5245 0.9700 36.4755 12.4745 15.6637 21.9306 7.6441 0.8747 13.0581 18.1731 1.4488 6.3461 29.8075 0.1695 1.2606 3.2242 0.6693 3.0197 14.5690 105.2520
temp: 298.150 k
press: 1.00000 atm
elementType: 16 9 8 8 7 7 7 7 6 6 6 6 6 6 6 6 6 6 6 6 6 6 6 6 6 6 6 6 6 6 1 1 1 1 1 1 1 1 1 1 1 1 1 1 1 1 1 1 1 1 1
symmnumber: 1
zpe: 1014152.3 jmol-1
zpe.correction: 0.386270 hartree
zpe.thermalcorrener: 0.414652 hartree
zpe.thermalcorrenthalpy: 0.415596 hartree
zpe.thermalcorrgfe: 0.325271 hartree
zpe.sumelectzpe: -1715.998722 hartree
zpe.sumelectthermal: -1715.970340 hartree
zpe.sumelectthermalent: -1715.969396 hartree
zpe.sumelectthermalfe: -1716.059721 hartree
dipole: -2.5547 -2.9774 -0.3156
dipole: 3.9359
quadrupole: -255.0505 -175.1774 -164.8734
quadrupole: 9.4160 -8.9326 -2.7412
quadrupole: -56.6834 23.1897 33.4937 9.4160 -8.9326 -2.7412
hfenergy: -1716.3849924 hartree
pointgroup: C01 [X(C22H21F1N4O2S1)]
dipole: -0.9006221 -1.173836 0.4569526 debye
polarizability: 612.5647245|37.3048885|362.8723188|-11.015232|-54.0822684|257.9172501 unknown
InChI: InChI=1S/C21H18FN4.CH3O2S/c1-26(2)20-12-14(23)8-10-18(20)25-21-15-5-3-4-6-17(15)24-19-11-13(22)7-9-16(19)21;1-4(2)3/h3-12,23,25H,1-2H3;1H3
charge 0 multiplicity 1
51 atoms
S  5.970976 0.330344 -1.117777
F  -4.779796 3.574294 -2.071022
O  7.352619 0.975301 -1.686189
O  5.911314 -0.418301 0.330965
N  -0.343737 -0.232869 0.901684
N  1.722522 0.07764 2.6182
N  -4.248629 -1.010507 -0.732217
N  4.543763 1.865833 -1.000402
C  -1.609442 -0.460001 0.327921
C  0.790766 0.393161 0.365188
C  -2.383983 0.588197 -0.270118
C  -2.174114 -1.77749 0.41873
C  1.913031 0.526191 1.262728
C  -3.697087 0.240138 -0.813614
C  -3.515693 -1.989876 -0.111715
C  3.135301 1.010654 0.772951
C  3.284955 1.375116 -0.599655
C  0.929474 0.779197 -0.996134
C  2.164839 1.240243 -1.477317
C  -1.970979 1.966179 -0.300001
C  -1.471487 -2.898785 0.982686
C  -4.489568 1.26573 -1.440631
C  -4.108277 -3.296342 -0.002074
C  -2.763038 2.947092 -0.888363
C  -2.075676 -4.151962 1.068329
C  2.927863 -0.434575 3.311423
C  0.924725 0.996065 3.480828
C  -4.009897 2.561215 -1.467243
C  -3.411814 -4.35023 0.581875
C  5.369203 -0.985102 -2.404645
H  -0.098117 -0.750576 1.761629
H  4.001739 1.123959 1.428926
H  0.08535 0.665496 -1.68183
H  2.269463 1.503037 -2.537668
H  -1.019651 2.255801 0.152978
H  -0.437117 -2.781334 1.325281
H  -5.460312 0.994314 -1.86135
H  -5.120233 -3.416867 -0.400167
H  4.550722 2.223135 -1.978907
H  -2.460618 3.997779 -0.910072
H  -1.524755 -4.996709 1.495544
H  3.612432 0.374924 3.649924
H  3.491258 -1.10376 2.641551
H  2.60998 -1.005254 4.201938
H  1.509946 1.895346 3.773872
H  0.617774 0.464015 4.398678
H  0.017683 1.329893 2.950728
H  -3.873631 -5.340464 0.659559
H  5.452912 -0.517904 -3.395415
H  6.053808 -1.836215 -2.284268
H  4.335932 -1.240769 -2.131522
