program: Gaussian 09
title: 000009110
version: EM64L-G09RevD.01
frameworkgroup: C1[X(C19H11N)]
method: RPBEPBE
basis: SDD
operation: Freq
keyword: #pfreq=noraman
keyword: PBEPBE/SDD
title: #p freq=noraman PBEPBE/SDD
converged: NO YES NO YES
title: Mulliken charges:
elementType: N C C C C C C C C C C C C C C C C C C C H H H H H H H H H H H
charge: -0.014216 0.039070 0.102311 0.311053 0.520984 0.167337 0.481609 0.457796 -0.079159 -0.814468 -0.417701 -0.489962 -0.469860 -0.367670 -0.348372 -0.371825 -0.456274 -0.378609 -0.255229 -0.249866 0.248512 0.228146 0.245247 0.240951 0.259758 0.226571 0.236458 0.246533 0.238229 0.230473 0.232172
chargesum: 0.00000
title: Mulliken charges with hydrogens summed into heavy atoms:
elementType: N C C C C C C C C C C C C C C C C C C C
charge: -0.014216 0.039070 0.102311 0.311053 0.520984 0.167337 0.481609 0.457796 -0.079159 -0.565956 -0.189555 -0.244715 -0.228909 -0.107912 -0.121801 -0.135367 -0.209740 -0.140380 -0.024756 -0.017693
polarizability: 4.15618765e+02 -1.15853451e+00 2.30542437e+02 -8.88889852e-04 7.69820866e-04 7.79727661e+01
1716.lowfreq: -0.0011 0.0004 0.0014 2.0977 8.3430 16.4543 64.7274 90.3908 156.4237
frequency: 64.7223 90.3825 156.4232 185.6825 211.2369 213.9271 284.6969 305.3200 329.7790 378.3831 394.7180 453.2813 459.7830 473.6577 508.0894 510.1630 519.1741 522.3214 556.0892 564.0958 574.9028 606.9511 632.3455 692.7948 698.9737 724.0359 752.8883 760.5982 778.2820 807.0070 808.9437 841.1287 851.9801 855.0667 868.7661 878.2969 886.3933 939.9794 961.7897 962.7447 965.5084 986.5334 991.3885 995.0182 1019.6672 1035.3425 1072.6453 1122.9622 1123.9405 1146.6956 1177.8115 1182.1334 1209.7392 1231.6537 1255.1817 1261.3035 1287.0387 1312.8731 1324.3922 1344.6696 1385.6575 1404.3242 1410.1973 1417.8487 1430.9939 1442.7479 1460.2554 1474.2092 1485.7322 1520.5692 1543.0045 1572.5476 1591.2864 1598.5575 1625.1711 1631.1861 3117.9550 3121.0858 3123.5390 3123.5698 3134.4557 3146.1981 3146.4091 3150.1625 3154.2709 3166.5081 3173.3827
redmass: 5.2215 4.1803 4.4078 4.9564 5.2634 4.2273 4.3367 4.2814 7.5051 5.9632 3.5955 5.0801 3.1635 7.1818 3.5980 5.6500 3.6505 6.5836 2.9838 6.4821 3.5145 6.8093 6.4227 3.6155 6.0844 3.5865 6.4727 1.2846 2.2495 5.3873 1.3818 2.3245 4.7172 1.7475 1.6231 1.6677 6.1919 2.0590 1.4179 6.8718 1.4438 1.3659 1.3841 1.3972 4.8211 2.2965 2.1513 3.0629 1.7898 1.3054 1.1037 1.2944 1.3643 2.0854 1.8964 1.7640 2.1054 4.3355 2.3027 3.3526 2.5502 1.9401 5.6202 2.9660 3.9972 4.1697 3.6332 3.2185 5.0087 4.4258 5.3688 7.7612 6.7086 6.2935 6.6758 7.0092 1.0909 1.0869 1.0878 1.0867 1.0884 1.0920 1.0958 1.0966 1.0920 1.0993 1.0966
irintensity: 0.3677 0.2732 1.8508 0.5916 1.1592 6.4677 1.2872 0.0000 0.0891 0.6653 2.2584 0.4358 5.2793 0.7371 0.5704 8.5807 0.0003 2.6670 8.4195 1.4644 3.8332 0.0147 4.5082 0.0150 0.9570 5.7808 6.2900 66.8385 32.0507 1.8079 1.7154 8.0041 0.1923 0.3144 23.5257 49.6196 1.2814 39.6642 0.0879 2.1914 12.6703 0.0473 1.2361 2.6384 0.7541 5.7204 1.4430 0.6963 1.5232 0.4791 6.2358 15.3601 7.5608 5.0563 2.2563 0.5482 1.1257 13.4940 4.7188 6.0495 4.1869 1.7308 5.3334 0.3727 1.0243 8.3301 0.6397 16.0825 16.9497 13.8332 19.1721 5.6492 0.1915 18.6786 2.7143 17.4204 2.7891 2.8486 18.6049 8.9526 7.7622 4.2277 21.6267 51.9431 22.0564 30.4173 25.2410
temp: 298.150 k
press: 1.00000 atm
elementType: 7 6 6 6 6 6 6 6 6 6 6 6 6 6 6 6 6 6 6 6 1 1 1 1 1 1 1 1 1 1 1
symmnumber: 1
zpe: 626030.4 jmol-1
zpe.correction: 0.238442 hartree
zpe.thermalcorrener: 0.251260 hartree
zpe.thermalcorrenthalpy: 0.252204 hartree
zpe.thermalcorrgfe: 0.199620 hartree
zpe.sumelectzpe: -784.126589 hartree
zpe.sumelectthermal: -784.113771 hartree
zpe.sumelectthermalent: -784.112827 hartree
zpe.sumelectthermalfe: -784.165412 hartree
dipole: -2.0761 2.4116 0.0000
dipole: 3.1822
quadrupole: -100.1506 -101.8752 -122.1571
quadrupole: 10.4718 -0.0001 0.0001
quadrupole: 7.9103 6.1858 -14.0961 10.4718 -0.0001 0.0001
hfenergy: -784.3650316 hartree
pointgroup: C01 [X(C19H11N1)]
dipole: 0.8235054 0.9430087 -0.0000031 debye
polarizability: 415.6258925|-0.1519225|230.5353095|-0.0008943|-0.0007635|77.9727661 unknown
InChI: InChI=1S/C19H11N/c1-2-4-15-13(3-1)11-14-6-5-12-9-10-20-17-8-7-16(15)18(14)19(12)17/h1-11H
charge 0 multiplicity 1
31 atoms
N  -3.549941 -1.704236 0.000025
C  -0.306632 0.236849 0.000013
C  -1.716605 -0.031646 0.000016
C  0.636618 -0.842995 0.000012
C  0.146879 1.618134 -0.000001
C  2.060686 -0.547318 0.000013
C  -2.677012 1.043524 0.000011
C  2.492375 0.839312 -0.000009
C  -2.204211 -1.388783 0.000022
C  1.523355 1.888382 -0.000008
C  0.120967 -2.191539 0.000013
C  -0.842287 2.681401 -0.000005
C  -2.195944 2.412089 0.000002
C  -1.240966 -2.45815 0.000019
C  3.070148 -1.56394 0.000009
C  -4.051352 0.699414 0.000017
C  3.896037 1.142153 -0.000017
C  -4.429092 -0.666054 0.000015
C  4.430502 -1.240476 0.000005
C  4.851003 0.12595 -0.000008
H  1.870899 2.929294 -0.000023
H  0.817476 -3.03501 0.000015
H  -0.484067 3.717912 -0.000011
H  -2.929314 3.22651 -0.000002
H  -1.625913 -3.482235 0.000022
H  2.780596 -2.618947 0.000019
H  -4.819118 1.48063 0.000023
H  4.205284 2.194165 -0.000023
H  -5.489915 -0.943392 0.000034
H  5.180387 -2.039146 0.000014
H  5.919158 0.368249 -0.000014
