program: Gaussian 09
title: 000149688
version: EM64L-G09RevD.01
frameworkgroup: C1[X(C8H14BrNO3)]
method: RPBEPBE
basis: SDD
operation: Freq
keyword: #p
keyword: freq=noraman
keyword: PBEPBE/SDD
title: #p freq=noraman PBEPBE/SDD
converged: YES YES NO NO
title: Mulliken charges:
elementType: Br O O O N C C C C C C C C H H H H H H H H H H H H H H
charge: -0.088680 -0.294099 -0.276023 -0.228305 -0.373917 -0.254693 0.318160 -0.646356 -0.646556 -0.424457 0.241519 -0.218917 -0.667694 0.243860 0.256122 0.242362 0.256316 0.242093 0.244020 0.365432 0.276449 0.276370 0.235510 0.235084 0.217468 0.234597 0.234335
chargesum: 0.00000
title: Mulliken charges with hydrogens summed into heavy atoms:
elementType: Br O O O N C C C C C C C C
charge: -0.088680 -0.294099 -0.276023 -0.228305 -0.008486 -0.254693 0.318160 0.095988 0.095874 0.128362 0.241519 0.251677 0.018706
polarizability: 1.37104881e+02 8.71709772e+00 1.44203089e+02 9.16928369e-02 1.48872483e-01 8.21888509e+01
1716.lowfreq: -11.3838 -3.4806 -0.0006 -0.0006 -0.0006 2.5494 13.2508 24.3160 39.0195
frequency: 13.1253 24.2436 39.0005 46.0291 53.5483 118.1017 134.7214 158.9143 207.1714 227.0280 234.0335 239.8647 248.2719 264.5479 274.5877 295.0099 316.3465 322.9137 351.8484 445.0368 542.7991 549.9247 587.1465 641.8826 691.7011 720.8701 798.5573 800.8314 849.7026 912.3484 938.3802 939.7447 978.5382 1005.2819 1023.4137 1100.3697 1111.7298 1113.8557 1137.2573 1173.9232 1181.3111 1207.7682 1214.2006 1243.8576 1250.3204 1328.8943 1359.5564 1373.0117 1388.9629 1401.9495 1449.1573 1459.7627 1460.4124 1462.9531 1465.6129 1473.0665 1475.0389 1485.2912 1490.2745 1586.6533 1654.5169 2993.2400 2994.5505 2995.7929 2997.6204 3017.1200 3034.0573 3076.3942 3093.3205 3094.2319 3097.5572 3109.5060 3109.7557 3113.5342 3499.8800
redmass: 3.9030 2.6368 4.7378 5.8371 4.6677 5.9873 2.4146 2.1002 6.6408 1.1083 4.0971 1.3694 2.4238 1.2882 2.8149 4.2119 3.6360 5.0902 3.2838 3.8344 4.4658 3.1806 4.3636 3.3509 1.1295 7.0295 1.1534 3.5522 4.9016 3.6379 1.4433 3.1622 2.0344 1.3004 2.5564 4.0480 1.9751 2.1707 1.4690 4.0908 3.0343 3.1319 1.0873 1.7701 1.1306 1.5368 1.3946 1.1810 1.1822 1.2617 1.0482 1.0744 1.0492 1.0394 1.0998 1.1719 1.1656 1.0936 1.5074 10.4816 10.8427 1.0348 1.0597 1.0353 1.0359 1.0582 1.0999 1.1065 1.0991 1.0986 1.0988 1.1020 1.1034 1.1013 1.0783
irintensity: 1.7806 0.0016 7.3758 0.1729 1.9278 0.3859 5.1672 2.6922 11.0243 1.3711 2.4815 2.5199 0.6361 1.7505 5.9330 7.4174 8.1479 10.3494 12.3738 11.7068 8.1581 1.0809 22.2870 28.1765 86.1647 2.4571 5.1076 9.7274 7.6454 10.4284 1.5989 65.2387 1.7180 0.2146 87.4661 1.7261 27.0744 50.3679 6.0868 5.0409 165.4225 211.2375 0.3684 15.9680 0.0565 0.3064 0.6548 21.8115 14.7924 19.3847 10.5359 10.5836 0.0082 13.1899 9.5932 80.8592 48.6958 3.8894 305.6392 173.3064 210.0895 10.4419 20.2918 7.8906 14.8911 17.2188 4.5282 3.8228 7.8783 31.1362 10.8879 2.7850 48.1805 26.4739 79.7778
temp: 298.150 k
press: 1.00000 atm
elementType: 35 8 8 8 7 6 6 6 6 6 6 6 6 1 1 1 1 1 1 1 1 1 1 1 1 1 1
symmnumber: 1
zpe: 563870.2 jmol-1
zpe.correction: 0.214767 hartree
zpe.thermalcorrener: 0.230941 hartree
zpe.thermalcorrenthalpy: 0.231885 hartree
zpe.thermalcorrgfe: 0.167400 hartree
zpe.sumelectzpe: -606.124090 hartree
zpe.sumelectthermal: -606.107916 hartree
zpe.sumelectthermalent: -606.106972 hartree
zpe.sumelectthermalfe: -606.171458 hartree
dipole: -0.5997 -2.8175 0.0234
dipole: 2.8807
quadrupole: -82.9195 -98.8028 -84.8055
quadrupole: 10.9192 0.0651 -0.0120
quadrupole: 5.9231 -9.9602 4.0371 10.9192 0.0651 -0.0120
hfenergy: -606.3388573 hartree
pointgroup: C01 [X(C8H14Br1N1O3)]
dipole: 0.261959 1.0905904 0.1627246 debye
polarizability: 137.4746452|8.994174|142.5985551|-0.2188371|8.4944279|83.4236204 unknown
InChI: InChI=1S/C8H14BrNO3/c1-4-13-6(11)5-10-7(12)8(2,3)9/h10H,4-5H2,1-3H3
charge 0 multiplicity 1
27 atoms
Br -2.046237 2.054164 0.350094
O  2.087335 0.56167 0.024849
O  -1.924432 -2.14016 -0.26206
O  3.242744 -1.441344 -0.293761
N  -0.300513 -0.497106 -0.066963
C  -2.75721 0.096443 0.09478
C  -1.599492 -0.919288 -0.092014
C  -3.548839 -0.241546 1.371921
C  -3.641276 0.12267 -1.165762
C  0.790182 -1.459156 -0.236294
C  2.168328 -0.814726 -0.176527
C  3.386074 1.307466 0.101786
C  3.040474 2.771384 0.348298
H  -2.915317 -0.176945 2.272022
H  -3.924514 -1.277096 1.279759
H  -4.403004 0.445589 1.488973
H  -4.019333 -0.901036 -1.341631
H  -4.494742 0.805965 -1.023714
H  -3.073202 0.443782 -2.054555
H  -0.062865 0.490142 0.071308
H  0.742373 -2.248468 0.538878
H  0.698645 -1.991864 -1.202799
H  3.983949 0.864221 0.917933
H  3.924226 1.148596 -0.849614
H  3.969829 3.365824 0.413292
H  2.426371 3.17745 -0.473576
H  2.484745 2.893068 1.293679
