program: Gaussian 09
title: 000149628
version: EM64L-G09RevD.01
frameworkgroup: C1[X(C13H10O3)]
method: RPBEPBE
basis: SDD
operation: Freq
keyword: #pfreq=noraman
keyword: PBEPBE/SDD
title: #p freq=noraman PBEPBE/SDD
converged: NO NO NO NO
title: Mulliken charges:
elementType: O O O C C C C C C C C C C C C C H H H H H H H H H H
charge: -0.235455 -0.230302 -0.203521 0.130394 0.053652 0.423147 0.127642 0.182080 0.392624 -0.614952 -0.339561 -0.838770 -0.485762 -0.791443 0.123775 -0.167911 0.256953 0.287151 0.228098 0.251867 0.228101 0.248582 0.232587 0.240596 0.232587 0.267844
chargesum: 0.00000
title: Mulliken charges with hydrogens summed into heavy atoms:
elementType: O O O C C C C C C C C C C C C C
charge: -0.235455 -0.230302 -0.203521 0.130394 0.053652 0.423147 0.127642 0.182080 0.392624 -0.357998 -0.052410 -0.130705 -0.237180 -0.085673 0.123775 0.099932
polarizability: 2.17137687e+02 3.49953251e+00 1.85116707e+02 -1.66545011e-03 3.59150108e-03 6.65971956e+01
1716.lowfreq: -13.5144 -12.0949 -8.2488 -0.0010 -0.0004 0.0005 35.3534 92.3611 96.3808
frequency: 35.1751 92.1713 96.3214 128.1320 176.3350 200.3602 223.2584 283.6906 294.8031 310.8618 329.8429 348.3080 373.8019 414.2847 449.2766 484.5257 528.8476 533.4389 559.1753 600.8555 633.2241 650.5685 682.1145 699.5551 744.2843 754.1386 783.4471 797.1295 844.1763 862.3235 873.3340 881.6554 893.3206 968.4486 1001.8445 1010.0979 1026.0260 1030.1370 1042.5601 1047.8624 1120.7546 1132.4552 1160.6654 1220.1210 1230.6748 1291.7610 1309.9902 1353.2397 1370.4112 1391.1178 1407.2554 1422.1447 1457.0182 1458.3671 1474.7857 1488.6574 1496.3368 1514.3552 1570.9170 1603.1121 1625.1704 1692.0707 2992.1713 3001.0280 3074.6073 3086.8771 3093.0357 3105.0202 3171.3301 3172.7107 3240.7169 3273.5713
redmass: 3.5139 1.2910 4.3176 3.0879 3.7129 6.7757 8.1078 3.2405 1.8270 2.0414 2.6465 3.5026 7.2346 7.4153 5.1226 5.6720 6.1105 3.9483 4.2276 4.1770 4.4286 4.7883 6.1517 4.3171 7.3981 1.5891 3.3656 6.6111 7.5173 1.3860 1.3892 1.3363 5.2860 2.8605 1.8837 2.3179 2.6509 1.5426 2.8803 1.5887 1.5979 4.1757 2.8610 1.4965 2.1348 3.6434 2.7176 2.6541 7.8591 1.2161 1.2468 3.4204 1.4132 1.0489 2.8030 1.0480 1.1649 4.9264 6.2409 9.0182 9.1561 10.3988 1.0380 1.0367 1.0982 1.0967 1.0986 1.0987 1.0927 1.0914 1.0919 1.1088
irintensity: 1.3942 0.5687 0.0021 5.4491 0.9085 3.1883 0.0134 2.5336 0.8685 0.5169 4.3772 0.0299 1.8861 9.8973 8.2283 1.5197 2.4202 3.7178 7.9968 1.5412 8.6534 2.8793 0.2983 0.7104 6.6134 60.2530 10.1440 47.6181 10.8869 9.5583 31.1706 14.0611 4.3078 1.7622 4.4748 36.5588 39.6541 0.0656 60.6750 16.4884 50.2646 8.2009 7.8443 2.5838 5.5702 24.1751 13.4622 30.4721 14.3227 4.2486 29.6291 120.8499 28.8805 0.3457 15.5140 36.9989 4.5460 16.1334 0.9647 75.7404 117.8279 551.7957 9.7700 37.5405 3.3969 25.9751 34.1760 11.7538 4.2210 3.0436 3.0242 0.0518
temp: 298.150 k
press: 1.00000 atm
elementType: 8 8 8 6 6 6 6 6 6 6 6 6 6 6 6 6 1 1 1 1 1 1 1 1 1 1
symmnumber: 1
zpe: 512553.0 jmol-1
zpe.correction: 0.195221 hartree
zpe.thermalcorrener: 0.208283 hartree
zpe.thermalcorrenthalpy: 0.209227 hartree
zpe.thermalcorrgfe: 0.155545 hartree
zpe.sumelectzpe: -725.932833 hartree
zpe.sumelectthermal: -725.919771 hartree
zpe.sumelectthermalent: -725.918827 hartree
zpe.sumelectthermalfe: -725.972508 hartree
dipole: 0.8377 5.3183 0.0004
dipole: 5.3839
quadrupole: -85.9512 -95.9038 -94.6338
quadrupole: -18.6811 -0.0010 -0.0004
quadrupole: 6.2117 -3.7409 -2.4708 -18.6811 -0.0010 -0.0004
hfenergy: -726.1280537 hartree
pointgroup: C01 [X(C13H10O3)]
dipole: -0.4645786 -2.0666021 0.0001763 debye
dipolederiv: -1.214355 -0.5620739 0.0000275 -0.3095061 -0.6038229 0.0000248 -0.0001071 -0.0000296 -0.1851644 -0.8230995 0.1680923 -0.0000072 -0.0098479 -0.5098856 0.0000317 -0.0000085 0.0000149 -0.1313955 -0.7700485 -0.3738708 -0.0000252 -0.7381067 -1.2357647 -0.0000448 0.0001064 0.0001297 -0.3418665 -0.6040574 -0.0425697 -0.000019 0.2079569 -0.3343642 0.0000099 0.0000096 0.0000069 -0.0751124 0.6578163 0.2835233 -0.0000317 0.1636996 0.4842193 -0.0000319 -0.0000179 0.0000032 0.132714 0.3658632 -0.0425427 0.0000011 0.1675354 0.352153 0.0000014 -0.0000194 0.0000023 -0.0256943 -0.2632231 -0.2570728 0.0000164 -0.3432046 -0.0689664 0.0000028 0.0000073 0.0000033 -0.0068951 0.7256545 -0.2208686 0.0000107 -0.0386258 0.1616106 -0.0000169 -0.0000067 -0.0000092 0.0655871 0.9044333 0.1582254 0.000042 0.0489812 0.601681 0.0000069 0.0000165 -0.0000379 0.0274953 -0.3320394 0.123977 -0.0000151 0.1546091 -0.0493784 -0.0000071 0.0000018 -0.0000104 -0.1861007 -0.139442 -0.0290717 -0.0000085 -0.0195029 0.001306 -0.000011 0.0000057 -0.000009 -0.1847009 0.0041614 0.1145376 -0.0000022 0.0075025 -0.09748 0.0000001 0.0000084 0.0000016 0.0579534 -0.1576884 0.0138422 0.0000085 -0.4333376 -0.8381042 0.0000003 0.0000256 -0.0000012 -0.1954477 -0.0415184 0.0591947 -0.0000056 0.1269236 -0.1903897 0.000015 -0.0000375 0.0000451 0.0386911 1.4064483 0.52651 0.0000276 0.8989481 1.6816673 0.0000288 -0.0000079 -0.0000753 0.2752913 0.0777876 0.1318854 -0.000023 0.1601543 0.3754398 -0.0000252 0.0000234 -0.0000328 -0.1259114 0.0516493 -0.0649968 0.0000037 -0.0701951 -0.0231077 0.0000091 0.0000029 0.0000032 0.1715991 0.1230132 -0.0308668 0.0000052 0.0141348 0.0270041 0.0000077 0.0000009 0.0000072 0.1962614 0.0243619 0.0770659 -0.1124037 0.0540397 0.0151259 0.0013702 -0.1192135 0.0572243 -0.0339529 -0.0710012 -0.1814929 0.0000061 -0.0522523 0.0002072 0.0000026 0.0000018 0.000003 0.1126996 0.0243631 0.0770646 0.1123981 0.0540425 0.0151213 -0.001371 0.1192072 -0.0572256 -0.0339525 -0.0591265 0.0232852 -0.0000145 0.0250346 0.0733092 -0.0000001 0.0000013 -0.0000051 0.1627708 0.1081972 -0.0008906 0.0731509 0.0132801 0.00534 0.0824746 0.0406604 0.1040206 -0.0215335 -0.142298 0.0102438 -0.000005 -0.1215547 0.0699544 -0.0000026 -0.0000042 -0.0000031 0.1120335 0.1082098 -0.0008939 -0.0731426 0.0132787 0.0053252 -0.0824789 -0.0406432 -0.1040378 -0.0215337 0.0359382 0.0397637 0.0000054 0.0260126 0.0817997 0.0000034 -0.0000134 0.0000117 0.2161647 unknown
polarizability: 217.4559819|1.3976022|184.7984118|0.001429|-0.003692|66.5971956 unknown
InChI: InChI=1S/C13H10O3/c1-7-5-10-9(3-4-15-10)13-12(7)8(2)6-11(14)16-13/h3-6H,1-2H3
charge 0 multiplicity 1
26 atoms
O  0.775456 1.730915 -0.000231
O  -3.528057 -0.063986 -0.000113
O  2.803394 2.829922 -0.000206
C  0.631146 -0.761145 -0.000141
C  0.039172 0.547754 -0.000211
C  -0.258743 -1.91716 -0.000078
C  -1.361986 0.726467 -0.000213
C  -2.17071 -0.431088 -0.000121
C  2.105345 -0.790433 -0.000068
C  -1.65823 -1.736742 -0.000062
C  -2.254297 1.870769 -0.000245
C  0.213402 -3.365519 -0.000042
C  2.816553 0.400039 0.0000
C  2.930647 -2.064722 0.000001
C  2.226869 1.724561 -0.000022
C  -3.534312 1.361002 -0.000132
H  -2.329487 -2.599112 -0.000013
H  -1.96658 2.918841 -0.000317
H  0.81709 -3.614141 0.889847
H  -0.65852 -4.039084 -0.000017
H  0.81706 -3.614176 -0.889939
H  3.909651 0.38756 0.000067
H  2.729059 -2.686816 0.888942
H  4.004004 -1.817411 0.000023
H  2.729111 -2.686878 -0.888902
H  -4.522839 1.811285 -0.000108
