program: Gaussian 09
title: 000149729
version: EM64L-G09RevD.01
frameworkgroup: C1[X(C24H26N4O2S)]
method: RPBEPBE
basis: SDD
operation: Freq
keyword: #p
keyword: freq=noraman
keyword: PBEPBE/SDD
title: #p freq=noraman PBEPBE/SDD
converged: YES YES NO NO
title: Mulliken charges:
elementType: S O O N N N N C C C C C C C C C C C C C C C C C C C C C C C C H H H H H H H H H H H H H H H H H H H H H H H H H H
charge: 0.954159 -0.545359 -0.559137 -0.486096 -0.051538 -0.254229 -0.440278 0.230374 0.252973 -0.248880 0.231161 0.226119 0.270352 -0.083272 0.353131 -0.378560 0.221924 -0.478118 -0.381102 -0.284521 -0.358933 0.213711 -0.817245 -0.323067 -0.380924 -0.814776 -0.265906 -0.234046 -0.642067 -0.642275 -0.777220 0.345475 0.265028 0.235217 0.230769 0.271774 0.284876 0.220506 0.290283 0.217361 0.264342 0.229978 0.229527 0.229731 0.233082 0.230621 0.233252 0.249401 0.209046 0.267966 0.226029 0.250968 0.229561 0.223009 0.260794 0.295600 0.269451
chargesum: 0.00000
title: Mulliken charges with hydrogens summed into heavy atoms:
elementType: S O O N N N N C C C C C C C C C C C C C C C C C C C C C C C C
charge: 0.954159 -0.545359 -0.559137 -0.140620 -0.051538 -0.254229 -0.190877 0.230374 0.252973 -0.248880 0.231161 0.226119 0.270352 -0.083272 0.353131 -0.113532 0.221924 -0.242901 -0.150333 -0.012747 -0.074057 0.213711 -0.089096 -0.058726 -0.150947 -0.122436 -0.035285 -0.000793 0.060975 0.061262 0.048625
polarizability: 6.88222696e+02 1.22400941e+01 4.10395167e+02 1.78407148e+01 -1.56565656e+01 2.60370650e+02
1716.lowfreq: -17.7660 -3.8880 -3.1169 -0.0016 -0.0013 0.0006 4.4320 17.3390 23.2559
frequency: -17.5100 17.2273 22.9276 34.2365 41.5156 44.5402 65.9905 75.2401 86.6282 95.9455 98.5573 107.4793 115.6846 127.4015 144.1178 147.5428 159.1540 163.4878 167.1108 184.5831 201.8053 218.2833 238.6865 244.2837 251.5030 272.6294 285.0925 298.7993 306.0447 316.1170 324.2416 333.0643 341.5242 352.5013 363.9485 385.2559 394.6982 395.3821 427.8480 471.4136 472.3138 487.4833 510.0123 519.6045 526.6762 531.1636 534.5590 544.7860 564.3795 605.7774 609.2990 621.3894 637.2943 645.9837 691.0513 692.5602 727.6820 747.9297 757.6816 766.3317 779.4936 790.5814 793.5091 797.2908 807.5179 822.3878 837.8927 863.2621 873.1679 875.4236 880.7578 894.2959 901.5639 915.8576 938.7892 943.9699 962.9390 963.8772 974.0579 974.7410 991.1640 994.1707 1012.2185 1022.2444 1023.4355 1040.7338 1053.0043 1077.6209 1086.6595 1094.0840 1114.6008 1138.3388 1141.2806 1157.7987 1163.1902 1179.1808 1181.3511 1196.5841 1223.7086 1229.9882 1250.0677 1264.5238 1268.6694 1279.0408 1292.0821 1303.4059 1324.0099 1332.2067 1354.2264 1378.7858 1386.0475 1396.6573 1399.8352 1409.9482 1412.7138 1417.8539 1425.4996 1427.4459 1440.9254 1443.5130 1455.1423 1459.5510 1461.4003 1463.5601 1465.8648 1472.2397 1477.4086 1478.9580 1484.9870 1488.4321 1498.6339 1509.4947 1522.9634 1547.3962 1553.0620 1560.3557 1601.0234 1606.6309 1625.7240 2926.8689 2931.8032 2968.7820 2972.8515 3026.5016 3037.0110 3040.5233 3041.1083 3046.9790 3085.8346 3094.9482 3106.8649 3115.1282 3121.9972 3123.9037 3126.5521 3137.7273 3155.4709 3164.1109 3169.2635 3170.3129 3176.4977 3180.3592 3186.2257 3306.8062 3341.3764
redmass: 6.7572 6.0704 4.7997 4.5890 5.5406 4.0191 3.9139 3.1056 3.3775 1.4586 1.9934 7.1308 4.0620 4.2165 1.5867 1.7925 3.9868 1.5553 2.2677 3.2341 4.6639 1.2065 3.1759 2.4992 1.9919 2.1064 4.1073 4.4851 3.5128 4.1329 4.1943 4.8551 4.9979 3.1042 6.9526 4.2076 5.5217 4.3405 3.3923 4.8341 3.6741 3.4951 4.3395 5.1007 3.5063 7.9338 3.5315 5.0244 5.0674 5.4457 5.1499 3.8746 4.2448 5.3959 5.3596 5.5270 2.9608 4.2331 4.0350 1.5438 1.5544 6.5879 1.7817 4.9600 1.6101 2.3821 3.2950 1.6034 1.8084 2.8131 2.5606 1.5696 4.9023 2.8457 1.3088 1.3095 1.3642 1.3588 2.0173 2.4351 2.0416 1.3279 2.0044 1.7115 1.6786 1.6372 1.6220 2.4978 1.2995 2.0309 2.0786 1.4335 1.4311 1.3086 1.2292 2.5161 1.7057 1.5225 2.2690 2.0601 2.1903 2.2504 2.8621 1.1420 4.6987 1.6904 3.3276 2.4993 2.7250 1.7847 2.1073 3.2415 1.3003 1.0595 2.5349 1.0628 1.2847 2.8112 1.9313 2.2645 2.3803 1.4428 1.5576 1.1371 1.0747 1.1808 1.1861 1.0803 2.1243 1.0495 1.1558 3.6309 5.8894 7.2621 6.2345 3.9821 6.3380 6.1360 6.5586 1.0484 1.0470 1.0389 1.0384 1.0238 1.0963 1.0849 1.0852 1.0963 1.0987 1.1009 1.1012 1.0961 1.0896 1.0861 1.0882 1.0889 1.0948 1.0950 1.0941 1.0998 1.1070 1.1080 1.0923 1.0751 1.0735
irintensity: 2.0490 1.2961 0.9745 0.0458 0.3084 2.8001 2.3732 0.7321 1.0575 4.1179 5.6985 45.7776 21.9207 28.4156 3.0930 2.9317 6.2133 6.1534 0.5980 20.7827 32.4831 4.4788 0.7180 2.1653 0.9098 2.3284 0.7479 4.6906 6.7812 6.1299 15.7529 6.6523 5.8080 0.5036 16.3327 2.4643 19.0687 5.6610 7.9053 13.1931 16.2663 27.9565 9.8965 8.1875 3.3880 39.5890 1.0535 5.9240 0.8256 36.2813 3.0898 11.0993 1.8145 4.3148 16.5072 0.7658 88.4819 15.9972 3.4608 123.8964 59.2518 99.7311 53.3694 40.8663 8.2888 2.9403 47.8787 77.9650 5.1186 30.7754 9.2274 5.2028 3.3082 4.4425 44.5730 81.7565 1.1670 0.3288 6.8301 45.6155 48.4874 0.3144 31.9610 11.1739 9.3827 11.8254 1.1705 32.3599 10.3589 12.1461 23.8692 6.5237 9.7828 4.2743 2.0751 48.4963 2.4316 3.9170 50.3085 8.0044 10.3529 36.0143 17.5079 15.5065 5.5148 3.0258 46.0763 99.3009 72.0625 2.1801 134.6526 21.0510 18.6043 4.9295 9.5232 10.8925 3.4456 121.0432 2.9936 139.5237 53.4351 21.6254 64.4681 8.6946 5.3517 4.8847 23.2032 13.3783 98.0981 24.9855 79.1302 466.1066 73.5249 50.2247 5.1823 71.7751 302.4056 59.9394 15.0788 44.0865 145.2471 84.3415 15.3814 1.7008 32.3364 43.7720 7.3251 6.1589 18.8507 17.2117 20.2073 4.2617 6.6444 1.2406 12.6822 12.5207 18.8750 13.2627 5.2633 34.5948 0.3219 2.1219 0.9594 16.9575 100.3833
temp: 298.150 k
press: 1.00000 atm
elementType: 16 8 8 7 7 7 7 6 6 6 6 6 6 6 6 6 6 6 6 6 6 6 6 6 6 6 6 6 6 6 6 1 1 1 1 1 1 1 1 1 1 1 1 1 1 1 1 1 1 1 1 1 1 1 1 1 1
symmnumber: 1
zpe: 1177874.7 jmol-1
zpe.correction: 0.448629 hartree
zpe.thermalcorrener: 0.478750 hartree
zpe.thermalcorrenthalpy: 0.479695 hartree
zpe.thermalcorrgfe: 0.386775 hartree
zpe.sumelectzpe: -1695.286673 hartree
zpe.sumelectthermal: -1695.256552 hartree
zpe.sumelectthermalent: -1695.255607 hartree
zpe.sumelectthermalfe: -1695.348527 hartree
dipole: 5.8181 0.0433 -0.4202
dipole: 5.8334
quadrupole: -252.6669 -171.0315 -173.1895
quadrupole: -10.9915 6.8879 4.7846
quadrupole: -53.7043 27.9311 25.7731 -10.9915 6.8879 4.7846
hfenergy: -1695.735302 hartree
pointgroup: C01 [X(C24H26N4O2S1)]
dipole: 2.2805445 0.230552 -0.1150312 debye
polarizability: 686.1251818|21.3092277|396.6778151|23.1669669|49.5628335|276.1855153 unknown
InChI: InChI=1S/C23H23N4.CH3O2S/c1-14-9-11-18-22(15(14)2)25-19-8-6-5-7-17(19)23(18)26-20-12-10-16(24)13-21(20)27(3)4;1-4(2)3/h5-13,24,26H,1-4H3;1H3
charge 0 multiplicity 1
57 atoms
S  -6.036406 -0.398071 -1.254954
O  -7.492149 -1.015922 -1.657771
O  -5.858259 0.511484 0.097285
N  0.133572 0.277842 1.039282
N  4.064041 1.133665 -0.45511
N  -2.015224 0.007094 2.653828
N  -4.584504 -2.023131 -1.011631
C  1.417536 0.532594 0.508503
C  2.265204 -0.515317 0.020731
C  3.588493 -0.152445 -0.487172
C  1.90844 1.878571 0.538782
C  4.465474 -1.18357 -1.018712
C  -0.948866 -0.403358 0.476981
C  3.263819 2.117323 0.059979
C  4.053692 -2.52711 -0.99245
C  1.905796 -1.903455 0.062723
C  -2.117489 -0.523375 1.317319
C  2.776253 -2.869887 -0.428061
C  1.127729 2.998786 0.991915
C  -0.998302 -0.865028 -0.870026
C  -3.294989 -1.065909 0.788149
C  -3.362087 -1.499768 -0.574576
C  5.816788 -0.791851 -1.580116
C  3.791806 3.455466 0.109251
C  -2.192194 -1.376742 -1.394411
C  4.947969 -3.628437 -1.531581
C  1.670953 4.281986 1.020431
C  3.020452 4.511246 0.585653
C  -3.269693 0.538945 3.237386
C  -1.264983 -0.851696 3.614523
C  -5.507545 0.771888 -2.709067
H  -0.168233 0.81465 1.869944
H  0.945342 -2.205717 0.488469
H  2.489821 -3.927285 -0.383728
H  0.084078 2.852657 1.293099
H  -0.115277 -0.767809 -1.507284
H  -4.196303 -1.164806 1.397345
H  5.890359 -1.043863 -2.656293
H  5.971958 0.289822 -1.458243
H  6.63681 -1.332838 -1.069788
H  4.816552 3.599093 -0.246772
H  -2.232448 -1.692357 -2.444891
H  4.449816 -4.611279 -1.481235
H  5.230903 -3.442223 -2.584982
H  5.893893 -3.698135 -0.960251
H  1.062549 5.126074 1.362845
H  3.433093 5.525526 0.617895
H  -4.536751 -2.381113 -1.990932
H  -3.957244 -0.261364 3.591707
H  -3.805207 1.143589 2.487922
H  -3.01741 1.178509 4.101877
H  -0.321965 -1.200793 3.162148
H  -1.023525 -0.266722 4.519805
H  -1.857512 -1.742734 3.918788
H  -5.638883 0.201857 -3.639129
H  -6.190352 1.630791 -2.646568
H  -4.463797 1.057949 -2.518329
