program: Gaussian 09
title: 000149602
version: EM64L-G09RevD.01
frameworkgroup: C1[X(C13H11N2S)]
method: RPBEPBE
basis: SDD
operation: Freq
keyword: #p
keyword: freq=noraman
keyword: PBEPBE/SDD
title: #p freq=noraman PBEPBE/SDD
converged: NO YES NO NO
title: Mulliken charges:
elementType: S N N C C C C C C C C C C C C C H H H H H H H H H H H
charge: 0.282941 -0.655158 -0.654790 0.667181 0.666865 -0.322325 -0.321197 -0.424893 -0.353163 -0.353293 -0.487492 -0.488375 0.546148 0.545523 -0.424092 -0.423950 0.266927 0.255868 0.256186 0.261137 0.261626 0.255071 0.254927 0.348109 0.345995 0.346076 0.348149
chargesum: 1.00000
title: Mulliken charges with hydrogens summed into heavy atoms:
elementType: S N N C C C C C C C C C C C C C
charge: 0.282941 0.038946 0.039435 0.667181 0.666865 -0.322325 -0.321197 -0.157967 -0.097295 -0.097107 -0.226356 -0.226748 0.546148 0.545523 -0.169021 -0.169022
polarizability: 4.47822814e+02 9.26597589e-03 1.65494539e+02 -2.13086407e-02 8.86043178e-03 6.28143983e+01
1716.lowfreq: -7.8852 -0.0023 -0.0018 -0.0008 5.1356 5.6085 47.0171 82.7480 163.2222
frequency: 47.0106 82.7466 163.2221 168.2757 174.1288 194.9897 277.6949 293.7265 305.7559 382.2695 420.1060 423.6543 432.8582 442.5195 450.3461 471.5761 479.9614 484.1028 507.8099 583.4597 589.0605 593.6069 613.7478 618.1299 674.0647 676.1872 744.1318 748.2398 809.0714 819.2922 832.0134 843.0537 869.7150 873.6097 895.6368 896.7562 942.7933 976.2024 989.5377 1022.6492 1037.3583 1043.0044 1056.1623 1149.6624 1175.1676 1214.2888 1275.6903 1284.3391 1290.5111 1351.6533 1364.2457 1395.0994 1405.7010 1449.3328 1481.7293 1500.5572 1503.6701 1525.7391 1530.1742 1580.0511 1624.1118 1649.0038 1662.0911 1664.8944 3120.7118 3137.2515 3140.0604 3141.1682 3141.6008 3161.9656 3163.1327 3532.5436 3534.4196 3667.3724 3668.2321
redmass: 6.7903 4.0950 4.9016 4.5005 5.6898 4.2122 4.3505 6.9442 4.7032 3.7789 3.2287 11.9600 2.8278 3.2689 2.8575 6.9617 1.0334 1.0424 6.7814 1.6373 1.4775 5.5621 2.2354 2.3272 7.2146 7.3201 3.2089 3.1829 5.2409 1.3935 1.4953 4.5391 1.6383 1.6630 6.0417 5.4575 1.4027 1.3676 1.4732 2.8642 1.9420 1.5373 1.9910 1.4729 1.2331 1.2593 1.5139 1.3721 2.3634 1.8237 2.9042 2.7061 3.8387 3.8366 6.1113 6.8394 3.7260 4.9441 4.7300 5.6139 5.1706 3.5225 1.2271 1.4087 1.0908 1.0925 1.0882 1.0920 1.0887 1.0987 1.0987 1.0464 1.0468 1.1039 1.1040
irintensity: 6.5712 0.0000 4.2246 0.0002 2.7050 5.4793 0.6549 0.4069 0.0004 0.5468 3.9103 21.7105 27.5260 1.4994 0.0001 0.0103 0.1675 1.4592 15.0916 10.2267 476.4523 0.0261 0.0959 89.9150 6.7600 0.3481 0.0003 0.0115 0.2445 59.0446 0.0543 10.4856 89.9873 4.8576 6.8993 0.6998 29.0308 0.0030 5.0852 3.0030 2.4458 0.1150 1.0604 26.3050 4.6253 236.5421 2.4969 18.9687 0.7401 103.3034 11.7473 179.8005 11.4444 9.1360 9.2460 121.2174 264.8729 37.4441 0.5827 710.2045 975.0818 8.3901 525.4821 90.5627 1.7401 1.8620 0.9247 1.0620 1.5865 9.2937 7.1703 722.2852 43.1058 43.5115 44.9383
temp: 298.150 k
press: 1.00000 atm
elementType: 16 7 7 6 6 6 6 6 6 6 6 6 6 6 6 6 1 1 1 1 1 1 1 1 1 1 1
symmnumber: 1
zpe: 552892.5 jmol-1
zpe.correction: 0.210586 hartree
zpe.thermalcorrener: 0.223550 hartree
zpe.thermalcorrenthalpy: 0.224494 hartree
zpe.thermalcorrgfe: 0.171561 hartree
zpe.sumelectzpe: -1008.266053 hartree
zpe.sumelectthermal: -1008.253089 hartree
zpe.sumelectthermalent: -1008.252145 hartree
zpe.sumelectthermalfe: -1008.305078 hartree
dipole: 0.0025 -0.2439 0.0002
dipole: 0.2439
quadrupole: 13.3467 -72.9320 -106.0752
quadrupole: 0.0038 -0.0059 0.0025
quadrupole: 68.5669 -17.7118 -50.8551 0.0038 -0.0059 0.0025
hfenergy: -1008.4766388 hartree
pointgroup: C01 [X(C13H11N2S1)]
dipole: -0.0015476 0.0959579 0.0000976 debye
polarizability: 447.8122826|1.7243219|165.5050702|0.0213621|-0.0087308|62.8143983 unknown
InChI: InChI=1S/C13H11N2S/c14-10-3-1-8-5-9-2-4-11(15)7-13(9)16-12(8)6-10/h1-7H,14-15H2
charge 1 multiplicity 1
27 atoms
S  -0.014126 1.743799 -0.000245
N  5.104737 1.014554 0.000128
N  -5.122132 0.952708 -0.000424
C  1.26701 -0.802045 0.000059
C  -1.263636 -0.818421 -0.000069
C  1.417221 0.636254 -0.000077
C  -1.432536 0.617419 -0.000219
C  0.006028 -1.445414 0.000071
C  2.4788 -1.585935 0.000186
C  -2.465222 -1.617095 -0.00012
C  2.679967 1.24064 -0.000076
C  -2.700897 1.208894 -0.000374
C  3.860661 0.436237 0.000067
C  -3.871644 0.389428 -0.000354
C  3.734008 -1.001365 0.000195
C  -3.727028 -1.046629 -0.00024
H  0.012458 -2.543549 0.000173
H  2.38664 -2.677882 0.000298
H  -2.362508 -2.70789 -0.00004
H  2.770975 2.332934 -0.00017
H  -2.805566 2.299538 -0.000505
H  4.635801 -1.622736 0.000317
H  -4.621067 -1.678963 -0.000271
H  5.950506 0.44602 0.000231
H  5.223634 2.026736 0.00007
H  -5.251488 1.963553 -0.000443
H  -5.960196 0.372909 -0.000371
