program: Gaussian 09
title: 000149553
version: EM64L-G09RevD.01
frameworkgroup: C1[X(C10H8N4)]
method: RPBEPBE
basis: SDD
operation: Freq
keyword: #pfreq=noraman
keyword: PBEPBE/SDD
title: #p freq=noraman PBEPBE/SDD
converged: NO NO NO NO
title: Mulliken charges:
elementType: N N N N C C C C C C C C C C H H H H H H H H
charge: -0.463251 -0.098603 -0.023559 -0.609068 -0.114390 0.299330 0.377008 -0.091692 -0.346854 -0.317961 0.105419 -0.333613 -0.186869 -0.376739 0.229895 0.302538 0.256685 0.273899 0.224509 0.234465 0.343864 0.314988
chargesum: 0.00000
title: Mulliken charges with hydrogens summed into heavy atoms:
elementType: N N N N C C C C C C C C C C
charge: -0.160714 -0.098603 -0.023559 0.049784 -0.114390 0.299330 0.377008 -0.091692 -0.116959 -0.061276 0.105419 -0.059714 0.037641 -0.142275
polarizability: 2.23559048e+02 -5.96986702e+00 1.47025944e+02 2.77281283e-03 9.26156590e-04 5.29889675e+01
1716.lowfreq: -2.6802 0.0004 0.0006 0.0008 12.2434 13.9289 96.5923 103.1568 142.0919
frequency: 96.5884 103.1492 142.0907 189.5969 191.1875 278.4584 349.5188 353.7937 405.0127 420.1855 429.8804 497.7163 517.6891 537.8577 542.3752 572.3739 590.0150 646.2135 688.2768 714.5785 760.9056 766.1939 780.7845 823.4661 836.5864 874.5776 939.1207 951.5630 962.9721 988.6208 990.6490 1025.4983 1041.0542 1077.3193 1131.0199 1183.5990 1222.2909 1247.7923 1249.9962 1309.3210 1344.0886 1381.8587 1394.0677 1397.4838 1429.5832 1450.1171 1510.7759 1565.7836 1572.3849 1597.9113 1614.8969 1649.1034 3115.7989 3136.4266 3144.4978 3166.4468 3173.8207 3579.0422 3599.5598 3726.1678
redmass: 4.9377 1.1718 4.8689 4.5026 4.2076 4.5210 4.7225 3.6780 7.3004 1.8693 1.6676 5.8671 4.0831 4.3396 1.2385 3.0723 6.3491 7.2786 7.1166 3.7005 7.0218 5.5940 1.7264 1.4734 3.6356 4.5544 1.4188 1.3357 3.2883 4.8325 1.3586 2.4968 2.4106 2.1658 1.2244 1.7996 1.5973 1.9866 2.5410 3.4746 4.7601 1.9139 3.9499 2.8760 3.0076 5.4352 5.1636 4.1228 3.1313 3.6387 2.9503 3.4953 1.0890 1.0896 1.0897 1.0997 1.0954 1.0454 1.0808 1.1051
irintensity: 4.4774 92.4581 17.1397 5.7489 8.6046 2.6294 2.9323 5.8522 0.8889 103.7007 130.3501 0.9546 3.8645 3.0894 123.9342 12.7066 6.6151 5.1224 0.5989 9.8873 0.1677 12.1153 3.0512 110.9882 0.4806 0.1208 0.0766 0.2252 0.0115 12.5574 1.4691 4.0191 6.0511 16.5331 0.0728 14.9197 2.1847 3.4741 15.5081 59.9050 2.2576 64.9065 18.0502 38.6466 28.9912 24.8038 0.2803 71.7857 86.1977 23.8112 176.3349 490.1444 25.4060 9.5580 13.8618 24.4614 8.3333 138.1617 43.7105 44.5753
temp: 298.150 k
press: 1.00000 atm
elementType: 7 7 7 7 6 6 6 6 6 6 6 6 6 6 1 1 1 1 1 1 1 1
symmnumber: 1
zpe: 436515.6 jmol-1
zpe.correction: 0.166260 hartree
zpe.thermalcorrener: 0.176871 hartree
zpe.thermalcorrenthalpy: 0.177815 hartree
zpe.thermalcorrgfe: 0.130158 hartree
zpe.sumelectzpe: -603.937584 hartree
zpe.sumelectthermal: -603.926973 hartree
zpe.sumelectthermalent: -603.926029 hartree
zpe.sumelectthermalfe: -603.973685 hartree
dipole: -6.5932 0.3050 0.0001
dipole: 6.6002
quadrupole: -53.6747 -72.3157 -86.2749
quadrupole: -9.9404 -0.0006 -0.0004
quadrupole: 17.0805 -1.5606 -15.5198 -9.9404 -0.0006 -0.0004
hfenergy: -604.1038437 hartree
pointgroup: C01 [X(C10H8N4)]
dipole: -2.5942642 0.1132521 0.0000333 debye
dipolederiv: -0.7661822 0.0877017 0.000007 -0.1762339 -0.4558035 -0.0000108 0.0000003 -0.0000131 -0.2946087 -1.3956256 -0.2703614 -0.0000187 0.0420415 -0.3963582 0.0000047 -0.000013 0. -0.2851088 -0.3294045 -0.0298532 -0.0000022 0.0511329 -0.332688 0.000003 -0.0000002 -0.0000041 -0.2451771 -1.7243326 -0.5369832 -0.0000725 -0.6411889 -0.4120437 -0.0000141 -0.0001719 -0.0000367 -0.7571586 0.4522442 0.2555676 0.0000013 0.7657991 0.2439151 0.0000109 -0.0000021 0.0000062 -0.0206764 0.6617046 -0.0246303 0.0000087 -0.4316338 -0.311465 -0.0000039 0.0000233 -0.0000007 0.0437759 0.1309344 -0.226673 0.0000007 0.1528408 -0.2038569 -0.0000017 0.0000039 -0.0000072 0.054351 0.0919489 0.0459912 0.0000012 -0.550418 0.1355225 -0.0000094 -0.0000131 0.0000029 0.0414715 0.1824388 0.151851 0.0000103 0.1744248 0.1957872 0.0000077 0.0000101 0.000005 -0.1776611 -0.2844157 -0.0810814 -0.0000034 0.1434135 0.0445978 0.0000105 0.0000033 0.0000076 -0.1827615 2.1329606 0.5264689 0.0000643 0.2725919 0.7736659 0.0000096 0.0000574 0.0000067 0.2136467 0.1336886 0.0396934 0.0000051 -0.0778602 0.12594 0.0000028 0.000005 0.0000075 -0.1228611 -0.3001862 -0.058864 -0.0000029 -0.1209154 0.0364951 -0.0000008 -0.0000077 0.0000037 -0.131739 0.3758662 0.0150076 0.0000083 0.1659397 0.1392332 0.0000019 0.0000251 -0.000003 -0.0852836 0.0387665 0.0960784 -0.0000014 0.0648781 -0.0801072 -0.000002 -0.000005 -0.0000013 0.1731992 0.1692593 -0.0114437 -0.0000087 -0.0043077 0.1463076 0.0000011 -0.0000164 0.0000062 0.36212 0.0453932 -0.0970636 -0.0000044 -0.0374661 -0.0117163 -0.0000047 -0.0000027 -0.0000068 0.1638392 0.0738437 -0.089448 -0.000003 -0.0391608 -0.0004317 -0.0000027 -0.0000027 -0.0000038 0.1460131 0.0239156 0.094413 -0.0000002 0.1189501 -0.078653 -0.0000007 0.0000026 -0.0000026 0.1631524 -0.1763992 0.0376174 -0.0000051 0.0259276 0.0766409 0. -0.0000174 0.0000036 0.1305009 0.2029212 0.0452359 0.000003 0.1178066 0.2330129 0.0000097 0.0000366 0.0000287 0.4003064 0.2606601 0.0307755 0.0000124 -0.0165617 0.1320053 -0.0000111 0.0000849 0.0000012 0.4106595 unknown
polarizability: 223.5895797|-5.7707627|146.9954122|0.0027704|0.0009334|52.9889675 unknown
InChI: InChI=1S/C10H8N4/c11-10-13-8-4-3-7-6(9(8)14-10)2-1-5-12-7/h1-5,13H,11H2
charge 0 multiplicity 1
22 atoms
N  -2.666258 0.833499 -0.000091
N  -1.719902 -1.251216 -0.000054
N  2.915972 0.716891 0.000008
N  -4.131312 -1.123405 -0.000141
C  -0.708215 -0.266494 -0.00006
C  -1.269197 1.041195 -0.000057
C  0.710851 -0.433321 -0.00005
C  1.526352 0.772161 -0.000014
C  -0.482485 2.222275 -0.000023
C  0.909017 2.071977 0.000002
C  -2.874399 -0.555524 -0.000106
C  1.372339 -1.698797 -0.000046
C  2.76993 -1.734335 -0.000023
C  3.496823 -0.500603 -0.000012
H  -0.93741 3.218926 -0.000019
H  -3.378756 1.560188 -0.000132
H  1.577155 2.937848 0.000036
H  0.768836 -2.612103 -0.000068
H  3.314038 -2.684499 -0.000023
H  4.594083 -0.509352 0.000018
H  -4.183808 -2.137651 -0.000085
H  -4.984254 -0.57456 -0.000061
