program: Gaussian 09
title: 000149539
version: EM64L-G09RevD.01
frameworkgroup: C1[X(C14H13NO3)]
method: RPBEPBE
basis: SDD
operation: Freq
keyword: #p
keyword: freq=noraman
keyword: PBEPBE/SDD
title: #p freq=noraman PBEPBE/SDD
converged: YES YES NO NO
title: Mulliken charges:
elementType: O O O N C C C C C C C C C C C C C C H H H H H H H H H H H H H
charge: -0.254841 -0.274745 -0.200453 -0.552362 0.035541 0.178640 0.065120 0.193664 0.269300 0.174629 -0.519255 -0.393449 -0.392490 0.370945 -0.779271 -0.476968 -0.811865 0.123744 0.238961 0.209126 0.255401 0.249051 0.249553 0.237321 0.248081 0.254445 0.241838 0.241781 0.241055 0.320832 0.256670
chargesum: 0.00000
title: Mulliken charges with hydrogens summed into heavy atoms:
elementType: O O O N C C C C C C C C C C C C C C
charge: -0.254841 -0.274745 -0.200453 0.025140 0.035541 0.178640 0.065120 0.193664 0.269300 0.174629 -0.071168 -0.138048 -0.143439 0.370945 -0.044316 -0.222523 -0.087191 0.123744
polarizability: 2.52189764e+02 -1.31685512e+01 2.02857214e+02 -1.41286528e+00 -3.78269317e+00 8.48443034e+01
1716.lowfreq: -1.0078 -0.0010 -0.0007 -0.0005 5.8612 9.3887 51.8153 69.7799 98.5935
frequency: 51.7976 69.7753 98.5913 111.9920 122.8115 139.9122 163.0570 164.4205 198.1694 204.8776 245.9054 274.9558 287.9077 304.5247 321.1696 354.6864 376.9415 418.1075 428.8585 495.7758 517.0326 523.2979 541.4598 554.4019 583.9452 609.0516 624.3692 639.8395 668.9599 692.4267 702.2642 746.7290 764.6413 781.5393 807.0421 807.5223 865.4988 872.8303 906.7253 943.1656 994.8096 1008.9521 1027.3052 1044.1587 1045.9674 1076.1859 1105.2659 1119.5142 1135.5129 1153.3832 1198.0102 1211.0705 1244.7838 1256.4855 1321.0119 1339.8571 1343.4900 1377.7711 1395.4418 1401.5278 1407.7929 1452.6311 1454.3063 1455.8976 1465.9398 1467.7395 1470.2003 1474.0406 1574.3278 1606.0068 1610.2853 1616.1057 1646.1025 1689.9229 2981.9068 2984.8592 2992.8347 3052.0256 3059.2677 3060.9847 3102.2373 3104.2074 3159.9125 3171.5207 3184.6188 3461.4906 3592.5838
redmass: 5.5503 3.6517 2.2203 4.3180 1.3500 3.4778 2.1327 2.0318 4.4176 2.1271 2.4506 4.0455 3.2755 3.2435 5.1153 1.3137 5.2570 7.3073 4.5314 4.8540 4.0475 4.2915 5.4079 5.0059 3.0824 3.7792 3.0207 3.1570 3.5719 4.6527 5.4320 7.1434 6.6450 7.7451 2.2117 2.4689 1.8478 1.3832 2.4574 1.3166 1.8506 3.1358 2.9260 1.4679 1.5815 4.0081 3.8216 3.2184 1.8355 1.6449 2.2450 3.9772 1.3969 3.8805 2.4016 1.5833 1.2397 2.6449 1.6934 1.9596 1.5151 1.1090 3.9991 1.0623 1.0459 1.3284 1.1076 2.9864 6.4595 8.6164 7.6976 7.9171 1.0876 10.5244 1.0381 1.0379 1.0619 1.1007 1.0970 1.0979 1.0986 1.0974 1.0879 1.0919 1.0971 1.0446 1.0985
irintensity: 1.6632 1.8597 0.7399 0.3195 0.0423 1.3373 1.1494 0.0513 1.0184 1.7088 3.8516 2.5201 0.5841 12.9254 2.2353 29.4726 10.9032 1.5459 14.5665 4.2867 0.8632 4.0158 9.9626 5.6721 60.8721 13.6323 78.0135 87.6687 96.0080 6.2857 17.3121 30.8345 13.6755 1.9815 46.9664 61.9227 21.8134 35.7691 9.4261 0.0689 5.1602 33.0012 87.8291 3.6238 7.1483 7.5318 23.4768 11.5228 9.2410 21.1876 1.8925 14.5581 14.2100 39.4835 1.1632 1.8297 1.8191 107.9568 4.0313 33.0835 47.7888 10.1736 1.4967 10.1928 17.0236 31.6103 13.9343 24.8357 1.5533 104.0091 28.8451 83.8168 25.0032 521.8788 12.6824 28.6210 53.9062 16.6377 11.7288 11.8801 21.7305 9.8909 2.1484 2.2404 5.9457 3.6449 7.6975
temp: 298.150 k
press: 1.00000 atm
elementType: 8 8 8 7 6 6 6 6 6 6 6 6 6 6 6 6 6 6 1 1 1 1 1 1 1 1 1 1 1 1 1
symmnumber: 1
zpe: 628561.2 jmol-1
zpe.correction: 0.239406 hartree
zpe.thermalcorrener: 0.255570 hartree
zpe.thermalcorrenthalpy: 0.256515 hartree
zpe.thermalcorrgfe: 0.196568 hartree
zpe.sumelectzpe: -820.438044 hartree
zpe.sumelectthermal: -820.421880 hartree
zpe.sumelectthermalent: -820.420936 hartree
zpe.sumelectthermalfe: -820.480882 hartree
dipole: 0.2624 -5.7166 0.5764
dipole: 5.7516
quadrupole: -85.6117 -119.8663 -104.1790
quadrupole: 12.9025 -1.2895 0.3652
quadrupole: 17.6073 -16.6473 -0.9600 12.9025 -1.2895 0.3652
hfenergy: -820.6774505 hartree
pointgroup: C01 [X(C14H13N1O3)]
dipole: 0.1322699 2.2563115 -0.1097864 debye
polarizability: 252.1377664|12.4496775|202.6543849|7.8067355|2.5218526|85.0991302 unknown
InChI: InChI=1S/C14H13NO3/c1-7-5-12(16)18-14-9(7)3-4-11-13(14)10(6-15)8(2)17-11/h3-5H,6,15H2,1-2H3
charge 0 multiplicity 1
31 atoms
O  2.681777 1.697069 0.133372
O  -0.87591 -1.390295 0.017919
O  -2.524683 -3.001994 -0.058214
N  1.715034 -2.79818 -0.956869
C  0.898338 0.234396 0.082887
C  2.120782 -0.56142 0.176916
C  -0.486337 -0.048724 0.014152
C  1.286126 1.60199 0.061231
C  -1.440017 1.012198 -0.058472
C  3.168367 0.346376 0.206191
C  2.227861 -2.080043 0.223651
C  0.391629 2.685365 -0.014895
C  -0.974738 2.368698 -0.071426
C  -2.85717 0.65948 -0.116281
C  4.652519 0.220836 0.296165
C  -3.2299 -0.673514 -0.106043
C  -3.909086 1.744689 -0.188321
C  -2.287361 -1.778835 -0.049799
H  1.669804 -2.458003 1.099378
H  3.286595 -2.359689 0.383136
H  0.748786 3.717767 -0.026193
H  -1.706292 3.179677 -0.12723
H  5.037662 0.658542 1.235769
H  4.950924 -0.839664 0.264571
H  5.147195 0.747196 -0.540592
H  -4.282694 -0.965672 -0.148875
H  -3.855722 2.412143 0.692165
H  -4.921535 1.31229 -0.228628
H  -3.769672 2.376561 -1.085458
H  0.691681 -2.844323 -0.987358
H  2.12664 -2.501817 -1.846549
