program: Gaussian 09
title: 000104431
version: EM64L-G09RevD.01
frameworkgroup: C1[X(C9H20N2O)]
method: RPBEPBE
basis: SDD
operation: Freq
keyword: #p
keyword: freq=noraman
keyword: PBEPBE/SDD
title: #p freq=noraman PBEPBE/SDD
converged: YES YES NO NO
title: Mulliken charges:
elementType: O N N C C C C C C C C C H H H H H H H H H H H H H H H H H H H H
charge: -0.276741 -0.098381 -0.369779 -0.402733 -0.350634 -0.359444 -0.510754 0.239375 -0.348172 -0.607635 -0.621178 -0.683883 0.247549 0.195507 0.211244 0.192461 0.244511 0.234316 0.291890 0.195703 0.226001 0.200334 0.242671 0.227355 0.187892 0.219053 0.221821 0.190000 0.225565 0.204931 0.210097 0.221059
chargesum: 0.00000
title: Mulliken charges with hydrogens summed into heavy atoms:
elementType: O N N C C C C C C C C C
charge: -0.276741 -0.098381 -0.077889 0.040322 0.053071 0.119382 -0.089051 0.239375 0.094833 0.026666 0.016208 -0.047796
polarizability: 1.50240616e+02 8.04797598e-01 1.04624984e+02 -3.54093899e+00 -4.08049067e+00 9.50368337e+01
1716.lowfreq: -7.1750 -0.0007 -0.0006 0.0005 3.5584 15.2363 18.6321 31.9547 39.5596
frequency: 18.0102 31.9166 39.4867 48.4406 69.9437 87.0370 103.9145 179.2164 208.0223 224.9355 231.1732 257.9690 276.8802 297.4214 324.8578 345.9514 364.8039 409.0023 439.7371 518.9184 551.9577 630.3292 691.9704 738.1818 746.5834 796.4536 863.4706 866.8983 885.9961 908.0460 969.9566 1032.7839 1044.6069 1057.2335 1059.1594 1075.3922 1084.5860 1092.3812 1098.9223 1117.9554 1136.4745 1170.7329 1208.3221 1226.2882 1239.9585 1259.3965 1269.1950 1277.8833 1293.9710 1308.6608 1328.4365 1349.6041 1358.8581 1369.8056 1388.8882 1416.8993 1438.6576 1445.9862 1449.0162 1459.0762 1463.1832 1473.2240 1475.3455 1475.6440 1477.5062 1481.3476 1485.3733 1485.4910 1486.6436 1613.3079 2837.6207 2844.2916 2862.4541 2969.2616 2971.6121 2990.0815 2990.9201 3012.1820 3016.1397 3018.0815 3022.9623 3026.0589 3047.9008 3050.3560 3072.9898 3075.7800 3076.6473 3082.5058 3085.5386 3556.6651
redmass: 3.1441 3.4817 3.0604 3.0141 2.2700 2.7373 3.1345 3.1524 1.3035 1.1480 1.1216 1.6834 2.9807 2.2382 3.6516 3.0557 2.0324 2.3142 2.6686 1.4806 2.0139 3.2076 2.7698 1.8437 1.2606 2.1179 1.5016 1.7853 1.9787 2.2614 2.2251 1.5231 2.8264 2.1476 2.3998 1.6495 1.9785 1.4748 2.0154 2.2798 1.4907 1.6800 1.6926 1.4898 1.4648 2.1794 1.7093 1.2224 1.1632 1.3227 1.2876 1.5724 1.3873 1.3407 1.2149 1.1407 1.1601 1.1034 1.1668 1.0656 1.0660 1.0682 1.0493 1.0841 1.0440 1.1730 1.1162 1.0807 1.4212 6.1929 1.0693 1.0574 1.0584 1.0523 1.0422 1.0645 1.0638 1.0722 1.0725 1.0722 1.0972 1.0716 1.1000 1.0993 1.0987 1.1020 1.1011 1.1007 1.1049 1.0780
irintensity: 0.0200 2.2609 5.9425 0.8335 0.3148 3.0959 2.3865 4.8352 0.4250 0.3549 0.0556 2.9859 8.3643 3.3141 6.1367 0.1049 4.9286 1.2354 12.3172 65.9165 34.3963 1.3346 0.9939 18.4840 4.8607 5.0550 3.9372 4.4696 8.4160 1.8517 31.2077 16.8340 2.4098 16.8531 6.7879 2.8668 6.1782 11.2511 9.7368 5.4286 7.8817 2.8151 55.6556 8.3904 15.1711 32.3426 4.5732 16.8836 2.1525 10.3344 6.0380 11.9662 12.7052 1.2335 9.8533 4.2815 10.5224 11.4383 39.7186 5.1703 10.7306 18.8166 4.0762 9.1660 10.6054 35.1629 57.5751 29.8198 142.4750 150.0125 52.6293 72.7582 267.6776 16.2879 45.4362 19.6870 19.6743 13.0766 35.1056 59.4355 17.8153 40.2177 0.1570 16.4341 48.5948 74.3914 28.3198 55.5681 23.5308 13.3855
temp: 298.150 k
press: 1.00000 atm
elementType: 8 7 7 6 6 6 6 6 6 6 6 6 1 1 1 1 1 1 1 1 1 1 1 1 1 1 1 1 1 1 1 1
symmnumber: 1
zpe: 745953.7 jmol-1
zpe.correction: 0.284119 hartree
zpe.thermalcorrener: 0.299635 hartree
zpe.thermalcorrenthalpy: 0.300579 hartree
zpe.thermalcorrgfe: 0.238854 hartree
zpe.sumelectzpe: -538.675296 hartree
zpe.sumelectthermal: -538.659779 hartree
zpe.sumelectthermalent: -538.658835 hartree
zpe.sumelectthermalfe: -538.720560 hartree
dipole: 1.4663 3.4367 -0.6229
dipole: 3.7879
quadrupole: -68.5190 -78.1836 -75.7722
quadrupole: -5.6063 3.0360 -0.5394
quadrupole: 5.6393 -4.0253 -1.6139 -5.6063 3.0360 -0.5394
hfenergy: -538.9594143 hartree
pointgroup: C01 [X(C9H20N2O1)]
dipole: 0.5734889 1.3524087 0.2511481 debye
polarizability: 150.3170867|1.9845005|106.1256617|-2.2154392|0.0841231|93.4596847 unknown
InChI: InChI=1S/C9H20N2O/c1-4-6-9(12)10-7-5-8-11(2)3/h10H,4-8H2,1-3H3
charge 0 multiplicity 1
32 atoms
O  -1.692739 -1.463314 -0.504447
N  3.638423 0.231198 -0.053018
N  -0.709353 0.634945 -0.66759
C  1.251956 -0.182658 0.685179
C  2.69694 -0.715624 0.600871
C  0.667052 0.108914 -0.715882
C  -3.177152 0.498622 -0.561914
C  -1.811215 -0.198906 -0.566912
C  -4.113082 -0.065158 0.534312
C  4.888148 -0.435073 -0.47489
C  3.913729 1.427934 0.76774
C  -5.548156 0.489803 0.423588
H  0.622098 -0.94474 1.180908
H  1.204947 0.73028 1.310333
H  2.693529 -1.647643 0.002312
H  3.047664 -0.994098 1.629091
H  1.315722 0.826155 -1.248177
H  0.643894 -0.830969 -1.297139
H  -0.855011 1.645005 -0.686927
H  -3.068293 1.5962 -0.45027
H  -3.644651 0.320748 -1.551671
H  -3.693201 0.16965 1.5323
H  -4.115703 -1.166849 0.445529
H  4.652932 -1.270553 -1.157878
H  5.484722 -0.84489 0.380403
H  5.527443 0.282871 -1.019977
H  4.580958 2.111123 0.212282
H  4.402609 1.18431 1.746464
H  2.978195 1.97229 0.982904
H  -5.565025 1.592578 0.516998
H  -5.998747 0.228233 -0.552627
H  -6.197537 0.075215 1.216106
