program: Gaussian 09
title: 000149568
version: EM64L-G09RevD.01
frameworkgroup: C1[X(C24H25N3O6S)]
method: RPBEPBE
basis: SDD
operation: Freq
keyword: #p
keyword: freq=noraman
keyword: PBEPBE/SDD
title: #p freq=noraman PBEPBE/SDD
converged: YES YES NO NO
title: Mulliken charges:
elementType: S O O O O O O N N N C C C C C C C C C C C C C C C C C C C C C C C C H H H H H H H H H H H H H H H H H H H H H H H H H
charge: 0.959102 -0.241016 -0.319129 -0.455763 -0.494845 -0.545643 -0.558868 -0.479327 0.013068 -0.451800 0.212064 0.302506 0.227948 -0.292394 -0.098732 0.317509 -0.429426 0.273472 -0.340752 -0.386304 -0.311405 -0.249190 0.162381 -0.311199 -0.279720 -0.107085 -0.263507 0.241933 -0.238349 -0.394197 -0.383720 -0.366091 -0.774291 -0.531476 0.350073 0.237186 0.269926 0.259458 0.265705 0.227203 0.232002 0.237693 0.273579 0.239876 0.233496 0.233872 0.300448 0.230671 0.247872 0.218230 0.255386 0.361202 0.261405 0.295094 0.271691 0.241411 0.252281 0.233473 0.365014
chargesum: 0.00000
title: Mulliken charges with hydrogens summed into heavy atoms:
elementType: S O O O O O O N N N C C C C C C C C C C C C C C C C C C C C C C C C
charge: 0.959102 -0.241016 -0.319129 -0.094561 -0.129831 -0.545643 -0.558868 -0.129254 0.013068 -0.196414 0.212064 0.302506 0.227948 -0.292394 -0.098732 0.317509 -0.192241 0.273472 -0.070826 -0.126846 -0.045700 -0.021987 0.162381 0.158497 -0.006141 0.132791 -0.030011 0.241933 -0.004477 -0.093748 -0.153049 0.100011 0.053900 0.195687
polarizability: 7.11252161e+02 -3.86489679e+01 3.94879705e+02 -5.82911869e+01 -2.23163629e+01 2.70652343e+02
1716.lowfreq: -6.0465 -3.0937 0.0009 0.0012 0.0014 2.0522 9.0923 11.7301 20.3202
frequency: 8.9166 11.6807 20.2477 21.1880 29.2831 33.5184 42.6137 49.7426 62.5852 68.7769 85.4365 93.2863 110.1494 112.1078 115.4349 131.8740 138.0185 155.2580 164.5469 175.9417 185.1483 190.0617 200.3173 213.6110 228.8582 241.0782 245.8022 253.5594 265.3347 272.7634 281.8561 296.5284 303.7715 313.5599 328.8186 361.9201 380.1867 391.6843 399.8060 409.2852 424.5484 443.4692 454.4160 466.2094 501.5739 504.6768 519.5292 524.3802 531.5074 537.7461 548.0230 569.5797 582.3349 590.8882 613.4125 623.9176 631.2503 637.9970 653.0915 657.2805 706.2702 713.1885 721.0183 746.7317 770.3597 772.4846 784.9375 797.0813 800.0353 812.8520 829.1848 832.9917 849.4489 859.8802 867.8224 869.8698 877.5989 882.1101 888.5875 912.4469 928.9052 931.2335 941.5324 943.2029 949.9443 966.2370 971.8309 991.3838 996.2667 999.7264 1005.3778 1017.4888 1040.3100 1083.7447 1087.7018 1092.0158 1112.0132 1115.9712 1119.1175 1145.6084 1151.4890 1154.6537 1163.7150 1179.5354 1181.4398 1182.3369 1193.0888 1221.5870 1236.1877 1241.4473 1250.2412 1266.9713 1270.4925 1277.6047 1285.3867 1295.3991 1320.8320 1333.4229 1351.8777 1356.6190 1366.1655 1386.6316 1388.7020 1392.7932 1399.8152 1411.2536 1416.6532 1422.1622 1429.2446 1437.3624 1452.7489 1457.2985 1466.5773 1467.0150 1467.8731 1469.6322 1475.0912 1482.0459 1515.5777 1527.2679 1546.9324 1557.7390 1568.5389 1601.4429 1607.1870 1625.5708 2978.7340 2982.1221 2984.0318 3027.5265 3052.0962 3057.3587 3074.5108 3074.6043 3126.9308 3133.8297 3134.4343 3135.7374 3148.3806 3155.2290 3165.4433 3171.9703 3172.3368 3173.9843 3177.4719 3181.6726 3190.9362 3318.7475 3474.1044 3485.1960 3613.9610
redmass: 8.3202 6.3757 5.6785 4.9162 4.9561 5.3946 5.8636 4.7886 5.5123 5.4349 4.6982 5.1705 8.3102 4.6652 4.2533 4.7778 5.3894 1.7660 2.6202 2.1177 3.7583 5.0862 4.6030 1.8208 4.0575 3.5114 1.1366 3.0765 3.8852 4.0322 3.4388 5.3527 5.2678 5.8778 5.6963 7.2134 6.1552 5.3534 4.1878 3.2098 4.1366 3.9370 3.3229 4.8561 5.7344 3.6976 1.1043 7.2331 8.2961 4.4844 5.1060 4.8568 4.5569 3.5645 2.6875 3.8703 2.9642 3.3483 5.0902 3.3477 5.6686 4.6699 3.9628 1.9915 1.8124 1.7876 4.6507 8.8658 1.4632 5.4456 4.0841 3.1968 1.6076 3.5532 1.6314 1.5508 1.8204 2.2326 4.6579 2.3194 3.9185 1.3276 5.4810 1.3774 3.0949 1.3247 1.3487 2.2426 1.3245 3.3993 2.0723 2.3972 4.5715 2.1033 2.1841 2.6616 1.6749 1.9475 1.2661 1.1562 1.3749 1.2979 1.1969 1.8817 1.2187 1.2650 1.2746 1.9030 1.7000 1.8321 2.6770 1.3552 1.8025 1.1547 2.1708 3.4409 2.6390 1.3017 2.4261 2.6795 1.3507 3.2386 1.4607 1.5476 2.4866 1.0582 1.0589 4.2363 4.3649 1.4539 2.5348 2.4019 1.3012 1.1802 1.3700 1.3042 1.8055 1.4284 4.2521 6.2681 6.7240 7.1767 3.6378 6.0463 6.4198 6.3977 1.0317 1.0554 1.0568 1.0238 1.1033 1.1070 1.1050 1.0928 1.0897 1.0858 1.0856 1.1018 1.0893 1.0934 1.0950 1.0962 1.0949 1.0992 1.1071 1.1079 1.0924 1.0751 1.0744 1.0649 1.0671
irintensity: 2.0326 1.5343 2.3780 0.0425 3.8113 0.4669 0.0529 1.4641 0.6087 1.9297 10.8804 4.7074 78.2182 3.1979 6.0639 27.1376 9.4576 15.3908 21.8723 27.4241 1.6393 7.0492 0.4685 11.0970 20.8449 1.7604 161.1211 6.3585 9.1847 0.4189 4.4635 6.4390 3.0767 12.6326 20.7142 15.8200 4.0616 2.5312 19.1117 17.1260 5.6545 9.5893 34.9207 0.9675 20.3808 0.6250 157.8871 0.7499 58.7253 8.2822 20.3702 8.1854 2.8560 11.9031 112.9132 8.9554 18.5094 64.8818 16.3801 56.3613 10.3702 26.8957 27.7870 48.9413 4.2785 87.2769 32.7774 124.6906 3.4110 7.9693 13.6401 20.0166 64.3580 7.3016 65.4449 6.6593 2.6359 8.3506 0.4237 22.3154 13.5555 2.9492 69.8574 104.5810 64.1042 2.1676 1.5904 38.7671 0.0655 69.2642 77.9271 33.1310 151.3110 51.7344 14.7627 33.3296 22.5149 116.8236 1.4808 27.6382 16.3567 9.6254 1.0465 55.4521 31.4390 6.6602 29.4103 16.6207 280.4203 56.3352 58.9284 32.7303 28.0760 26.8760 34.8746 13.4123 94.3932 42.3452 40.8418 116.5232 25.2716 107.6342 3.0067 34.9781 1.1554 4.3458 8.9374 177.7459 256.4066 1.8807 32.7055 54.6061 31.3139 39.5329 55.1763 12.1816 74.2229 129.7289 524.0274 55.9553 2.9735 36.7915 67.9674 2.1781 518.1399 6.7737 46.4229 45.7072 26.7678 1.2411 10.5054 44.7160 20.8850 38.1627 7.6668 5.2733 1.3171 16.3191 9.4075 22.6373 16.7531 25.4680 2.8919 27.2799 0.2332 1.8214 2.0807 14.1613 73.1174 37.0883 11.4761
temp: 298.150 k
press: 1.00000 atm
elementType: 16 8 8 8 8 8 8 7 7 7 6 6 6 6 6 6 6 6 6 6 6 6 6 6 6 6 6 6 6 6 6 6 6 6 1 1 1 1 1 1 1 1 1 1 1 1 1 1 1 1 1 1 1 1 1 1 1 1 1
symmnumber: 1
zpe: 1181850.1 jmol-1
zpe.correction: 0.450143 hartree
zpe.thermalcorrener: 0.483869 hartree
zpe.thermalcorrenthalpy: 0.484814 hartree
zpe.thermalcorrgfe: 0.379830 hartree
zpe.sumelectzpe: -1940.547532 hartree
zpe.sumelectthermal: -1940.513805 hartree
zpe.sumelectthermalent: -1940.512861 hartree
zpe.sumelectthermalfe: -1940.617845 hartree
dipole: -5.1818 0.5283 -2.3308
dipole: 5.7064
quadrupole: -293.0998 -191.2275 -179.7183
quadrupole: 2.1132 23.6273 -5.4270
quadrupole: -71.7513 30.1210 41.6303 2.1132 23.6273 -5.4270
hfenergy: -1940.9976748 hartree
pointgroup: C01 [X(C24H25N3O6S1)]
dipole: 2.0181801 -0.4533171 0.8728187 debye
polarizability: 718.8057476|27.4296619|338.6089819|-32.2018882|66.8141206|319.3694796 unknown
InChI: InChI=1S/C23H22N3O4.CH3O2S/c1-29-21-11-14(24)9-10-19(21)26-22-16-5-2-3-7-18(16)25-23-17(22)6-4-8-20(23)30-13-15(28)12-27;1-4(2)3/h2-11,15,24,26-28H,12-13H2,1H3;1H3
charge 0 multiplicity 1
59 atoms
S  -7.19905 -0.955214 0.866883
O  4.837483 -0.956633 -0.336354
O  -3.100947 1.106626 -2.419862
O  8.224535 -2.431799 -0.572751
O  6.930261 -3.171397 1.680629
O  -8.670197 -0.942979 1.572121
O  -7.047886 -1.047583 -0.76038
N  -0.978109 0.943364 -0.884632
N  3.029351 0.772742 0.662809
N  -6.136528 0.845451 1.416855
C  0.327378 0.896406 -0.331071
C  1.239325 -0.086651 -0.836364
C  0.773341 1.837948 0.649791
C  2.602853 -0.07807 -0.313521
C  2.141705 1.703427 1.139045
C  3.552122 -1.047573 -0.849901
C  0.856823 -1.077879 -1.804776
C  -2.20747 0.912004 -0.223368
C  -0.022974 2.935528 1.130751
C  3.148443 -1.979516 -1.811918
C  2.61533 2.614731 2.146958
C  1.794601 -1.993355 -2.27313
C  -3.3850 1.00828 -1.047556
C  5.845713 -1.93112 -0.798333
C  -2.37431 0.734767 1.178009
C  7.151717 -1.5682 -0.069475
C  0.478432 3.812437 2.089434
C  -4.824284 0.827983 0.924754
C  1.80354 3.641634 2.618361
C  -4.663919 0.991688 -0.4902
C  -3.659061 0.662741 1.738666
C  7.023218 -1.709868 1.453313
C  -6.258261 -2.509085 1.546715
C  -4.243975 1.125869 -3.344854
H  -1.060663 0.867655 -1.904713
H  -0.179817 -1.136367 -2.15037
H  -1.028645 3.08783 0.729293
H  3.854529 -2.712157 -2.211694
H  3.640713 2.471841 2.501038
H  1.49641 -2.751974 -3.004967
H  5.526407 -2.959254 -0.536658
H  5.996093 -1.847042 -1.891405
H  -1.492201 0.631407 1.815087
H  7.434186 -0.532756 -0.322469
H  -0.138702 4.647382 2.438749
H  2.175903 4.336169 3.379198
H  -5.567697 1.083474 -1.096171
H  -3.771516 0.502475 2.818165
H  6.1161 -1.18456 1.805766
H  7.927727 -1.299419 1.943837
H  -6.175891 0.777837 2.456745
H  8.16754 -3.27248 -0.041063
H  -6.383725 -2.502431 2.638133
H  -6.753062 -3.369104 1.074173
H  -5.211056 -2.406754 1.230041
H  -3.801643 1.126237 -4.351366
H  -4.878826 0.231928 -3.202779
H  -4.847724 2.040298 -3.19734
H  6.911361 -3.368339 2.647621
